KBirthday

Groupware

Source (link to git-repo or to original if based on someone elses unmodified work): Add the source-code for this project on opencode.net

0
5.0
Description:

Kbirthday is a kicker-applet that reminds you of birthdays and anniversaries from your KDE addressbook.
Last changelog:

16 years ago

Kkbirthday now reads icon name from desktop file to make it changeable. Two png icons (16x16 and 32x32) were added.

coyote22

13 years ago

I had problems compiling kbirthday in ubuntu, the configure fails withtha message: checking for Qt... configure: error: Qt (>= Qt 3.0) (headers and libraries) not found. Please check your installation!

And here's my config.log:

This file contains any messages produced by compilers while
running configure, to aid debugging if configure makes a mistake.

It was created by configure, which was
generated by GNU Autoconf 2.59. Invocation command line was

$ ./configure --prefix=/usr

## --------- ##
## Platform. ##
## --------- ##

hostname = ana-caligula
uname -m = i686
uname -r = 2.6.22-14-generic
uname -s = Linux
uname -v = #1 SMP Tue Dec 18 08:02:57 UTC 2007

/usr/bin/uname -p = unknown
/bin/uname -X = unknown

/bin/arch = unknown
/usr/bin/arch -k = unknown
/usr/convex/getsysinfo = unknown
hostinfo = unknown
/bin/machine = unknown
/usr/bin/oslevel = unknown
/bin/universe = unknown

PATH: /usr/local/sbin
PATH: /usr/local/bin
PATH: /usr/sbin
PATH: /usr/bin
PATH: /sbin
PATH: /bin
PATH: /usr/games


## ----------- ##
## Core tests. ##
## ----------- ##

configure:1542: checking build system type
configure:1560: result: i686-pc-linux-gnu
configure:1568: checking host system type
configure:1582: result: i686-pc-linux-gnu
configure:1590: checking target system type
configure:1604: result: i686-pc-linux-gnu
configure:1650: checking for a BSD-compatible install
configure:1705: result: /usr/bin/install -c
configure:1720: checking for -p flag to install
configure:1733: result: yes
configure:1744: checking whether build environment is sane
configure:1787: result: yes
configure:1808: checking for gawk
configure:1824: found /usr/bin/gawk
configure:1834: result: gawk
configure:1844: checking whether make sets $(MAKE)
configure:1864: result: yes
configure:2015: checking for style of include used by make
configure:2043: result: GNU
configure:2169: checking for gcc
configure:2185: found /usr/bin/gcc
configure:2195: result: gcc
configure:2439: checking for C compiler version
configure:2442: gcc --version </dev/null >&5
gcc.real (GCC) 4.1.3 20070929 (prerelease) (Ubuntu 4.1.2-16ubuntu2)
Copyright (C) 2006 Free Software Foundation, Inc.
This is free software; see the source for copying conditions. There is NO
warranty; not even for MERCHANTABILITY or FITNESS FOR A PARTICULAR PURPOSE.

configure:2445: $? = 0
configure:2447: gcc -v </dev/null >&5
Using built-in specs.
Target: i486-linux-gnu
Configured with: ../src/configure -v --enable-languages=c,c++,fortran,objc,obj-c++,treelang --prefix=/usr --enable-shared --with-system-zlib --libexecdir=/usr/lib --without-included-gettext --enable-threads=posix --enable-nls --with-gxx-include-dir=/usr/include/c++/4.1.3 --program-suffix=-4.1 --enable-__cxa_atexit --enable-clocale=gnu --enable-libstdcxx-debug --enable-mpfr --enable-checking=release i486-linux-gnu
Thread model: posix
gcc version 4.1.3 20070929 (prerelease) (Ubuntu 4.1.2-16ubuntu2)
configure:2450: $? = 0
configure:2452: gcc -V </dev/null >&5
gcc.real: '-V' option must have argument
configure:2455: $? = 1
configure:2478: checking for C compiler default output file name
configure:2481: gcc conftest.c >&5
configure:2484: $? = 0
configure:2530: result: a.out
configure:2535: checking whether the C compiler works
configure:2541: ./a.out
configure:2544: $? = 0
configure:2561: result: yes
configure:2568: checking whether we are cross compiling
configure:2570: result: no
configure:2573: checking for suffix of executables
configure:2575: gcc -o conftest conftest.c >&5
configure:2578: $? = 0
configure:2603: result:
configure:2609: checking for suffix of object files
configure:2630: gcc -c conftest.c >&5
configure:2633: $? = 0
configure:2655: result: o
configure:2659: checking whether we are using the GNU C compiler
configure:2683: gcc -c conftest.c >&5
configure:2689: $? = 0
configure:2693: test -z
|| test ! -s conftest.err
configure:2696: $? = 0
configure:2699: test -s conftest.o
configure:2702: $? = 0
configure:2715: result: yes
configure:2721: checking whether gcc accepts -g
configure:2742: gcc -c -g conftest.c >&5
configure:2748: $? = 0
configure:2752: test -z
|| test ! -s conftest.err
configure:2755: $? = 0
configure:2758: test -s conftest.o
configure:2761: $? = 0
configure:2772: result: yes
configure:2789: checking for gcc option to accept ANSI C
configure:2859: gcc -c conftest.c >&5
configure:2865: $? = 0
configure:2869: test -z
|| test ! -s conftest.err
configure:2872: $? = 0
configure:2875: test -s conftest.o
configure:2878: $? = 0
configure:2896: result: none needed
configure:2914: gcc -c conftest.c >&5
conftest.c:2: error: expected '=', ',', ';', 'asm' or '__attribute__' before 'me'
configure:2920: $? = 1
configure: failed program was:
| #ifndef __cplusplus
| choke me
| #endif
configure:3055: checking dependency style of gcc
configure:3117: result: gcc3
configure:3128: checking how to run the C preprocessor
configure:3163: gcc -E conftest.c
configure:3169: $? = 0
configure:3201: gcc -E conftest.c
conftest.c:11:28: error: ac_nonexistent.h: No such file or directory
configure:3207: $? = 1
configure: failed program was:
| /* confdefs.h. */
|
| #define PACKAGE_NAME ""
| #define PACKAGE_TARNAME ""
| #define PACKAGE_VERSION ""
| #define PACKAGE_STRING ""
| #define PACKAGE_BUGREPORT ""
| #define PACKAGE "kbirthday"
| #define VERSION "0.7.3"
| /* end confdefs.h. */
| #include <ac_nonexistent.h>
configure:3246: result: gcc -E
configure:3270: gcc -E conftest.c
configure:3276: $? = 0
configure:3308: gcc -E conftest.c
conftest.c:11:28: error: ac_nonexistent.h: No such file or directory
configure:3314: $? = 1
configure: failed program was:
| /* confdefs.h. */
|
| #define PACKAGE_NAME ""
| #define PACKAGE_TARNAME ""
| #define PACKAGE_VERSION ""
| #define PACKAGE_STRING ""
| #define PACKAGE_BUGREPORT ""
| #define PACKAGE "kbirthday"
| #define VERSION "0.7.3"
| /* end confdefs.h. */
| #include <ac_nonexistent.h>
configure:3438: checking for g++
configure:3454: found /usr/bin/g++
configure:3464: result: g++
configure:3480: checking for C++ compiler version
configure:3483: g++ --version </dev/null >&5
g++.real (GCC) 4.1.3 20070929 (prerelease) (Ubuntu 4.1.2-16ubuntu2)
Copyright (C) 2006 Free Software Foundation, Inc.
This is free software; see the source for copying conditions. There is NO
warranty; not even for MERCHANTABILITY or FITNESS FOR A PARTICULAR PURPOSE.

configure:3486: $? = 0
configure:3488: g++ -v </dev/null >&5
Using built-in specs.
Target: i486-linux-gnu
Configured with: ../src/configure -v --enable-languages=c,c++,fortran,objc,obj-c++,treelang --prefix=/usr --enable-shared --with-system-zlib --libexecdir=/usr/lib --without-included-gettext --enable-threads=posix --enable-nls --with-gxx-include-dir=/usr/include/c++/4.1.3 --program-suffix=-4.1 --enable-__cxa_atexit --enable-clocale=gnu --enable-libstdcxx-debug --enable-mpfr --enable-checking=release i486-linux-gnu
Thread model: posix
gcc version 4.1.3 20070929 (prerelease) (Ubuntu 4.1.2-16ubuntu2)
configure:3491: $? = 0
configure:3493: g++ -V </dev/null >&5
g++.real: '-V' option must have argument
configure:3496: $? = 1
configure:3499: checking whether we are using the GNU C++ compiler
configure:3523: g++ -c conftest.cc >&5
configure:3529: $? = 0
configure:3533: test -z
|| test ! -s conftest.err
configure:3536: $? = 0
configure:3539: test -s conftest.o
configure:3542: $? = 0
configure:3555: result: yes
configure:3561: checking whether g++ accepts -g
configure:3582: g++ -c -g conftest.cc >&5
configure:3588: $? = 0
configure:3592: test -z
|| test ! -s conftest.err
configure:3595: $? = 0
configure:3598: test -s conftest.o
configure:3601: $? = 0
configure:3612: result: yes
configure:3654: g++ -c conftest.cc >&5
configure:3660: $? = 0
configure:3664: test -z
|| test ! -s conftest.err
configure:3667: $? = 0
configure:3670: test -s conftest.o
configure:3673: $? = 0
configure:3699: g++ -c conftest.cc >&5
conftest.cc: In function 'int main()':
conftest.cc:15: error: 'exit' was not declared in this scope
configure:3705: $? = 1
configure: failed program was:
| /* confdefs.h. */
|
| #define PACKAGE_NAME ""
| #define PACKAGE_TARNAME ""
| #define PACKAGE_VERSION ""
| #define PACKAGE_STRING ""
| #define PACKAGE_BUGREPORT ""
| #define PACKAGE "kbirthday"
| #define VERSION "0.7.3"
| /* end confdefs.h. */
|
| int
| main ()
| {
| exit (42);
| ;
| return 0;
| }
configure:3654: g++ -c conftest.cc >&5
configure:3660: $? = 0
configure:3664: test -z
|| test ! -s conftest.err
configure:3667: $? = 0
configure:3670: test -s conftest.o
configure:3673: $? = 0
configure:3699: g++ -c conftest.cc >&5
configure:3705: $? = 0
configure:3709: test -z
|| test ! -s conftest.err
configure:3712: $? = 0
configure:3715: test -s conftest.o
configure:3718: $? = 0
configure:3743: checking dependency style of g++
configure:3805: result: gcc3
configure:4119: checking whether g++ supports -Wundef
configure:4155: rm -rf SunWS_cache; g++ -o conftest -Wall -pedantic -W -Wpointer-arith -Wmissing-prototypes -Wwrite-strings -ansi -D_XOPEN_SOURCE=500 -D_BSD_SOURCE -Wcast-align -Wconversion -O2 -Wundef conftest.cc 1>&5
cc1plus: warning: command line option "-Wmissing-prototypes" is valid for Ada/C/ObjC/Pascal but not for C++
configure:4161: $? = 0
configure:4165: test -z
|| test ! -s conftest.err
configure:4168: $? = 0
configure:4171: test -s conftest
configure:4174: $? = 0
configure:4195: result: yes
configure:4207: checking whether g++ supports -Wno-long-long
configure:4243: rm -rf SunWS_cache; g++ -o conftest -Wundef -Wall -pedantic -W -Wpointer-arith -Wmissing-prototypes -Wwrite-strings -ansi -D_XOPEN_SOURCE=500 -D_BSD_SOURCE -Wcast-align -Wconversion -O2 -Wno-long-long conftest.cc 1>&5
cc1plus: warning: command line option "-Wmissing-prototypes" is valid for Ada/C/ObjC/Pascal but not for C++
configure:4249: $? = 0
configure:4253: test -z
|| test ! -s conftest.err
configure:4256: $? = 0
configure:4259: test -s conftest
configure:4262: $? = 0
configure:4283: result: yes
configure:4295: checking whether g++ supports -Wnon-virtual-dtor
configure:4331: rm -rf SunWS_cache; g++ -o conftest -Wno-long-long -Wundef -Wall -pedantic -W -Wpointer-arith -Wmissing-prototypes -Wwrite-strings -ansi -D_XOPEN_SOURCE=500 -D_BSD_SOURCE -Wcast-align -Wconversion -O2 -Wnon-virtual-dtor conftest.cc 1>&5
cc1plus: warning: command line option "-Wmissing-prototypes" is valid for Ada/C/ObjC/Pascal but not for C++
configure:4337: $? = 0
configure:4341: test -z
|| test ! -s conftest.err
configure:4344: $? = 0
configure:4347: test -s conftest
configure:4350: $? = 0
configure:4371: result: yes
configure:4391: checking whether g++ supports -fno-exceptions
configure:4427: rm -rf SunWS_cache; g++ -o conftest -Wnon-virtual-dtor -Wno-long-long -Wundef -Wall -pedantic -W -Wpointer-arith -Wmissing-prototypes -Wwrite-strings -ansi -D_XOPEN_SOURCE=500 -D_BSD_SOURCE -Wcast-align -Wconversion -O2 -fno-exceptions conftest.cc 1>&5
cc1plus: warning: command line option "-Wmissing-prototypes" is valid for Ada/C/ObjC/Pascal but not for C++
configure:4433: $? = 0
configure:4437: test -z
|| test ! -s conftest.err
configure:4440: $? = 0
configure:4443: test -s conftest
configure:4446: $? = 0
configure:4467: result: yes
configure:4479: checking whether g++ supports -fno-check-new
configure:4515: rm -rf SunWS_cache; g++ -o conftest -Wnon-virtual-dtor -Wno-long-long -Wundef -Wall -pedantic -W -Wpointer-arith -Wmissing-prototypes -Wwrite-strings -ansi -D_XOPEN_SOURCE=500 -D_BSD_SOURCE -Wcast-align -Wconversion -O2 -fno-exceptions -fno-check-new conftest.cc 1>&5
cc1plus: warning: command line option "-Wmissing-prototypes" is valid for Ada/C/ObjC/Pascal but not for C++
configure:4521: $? = 0
configure:4525: test -z
|| test ! -s conftest.err
configure:4528: $? = 0
configure:4531: test -s conftest
configure:4534: $? = 0
configure:4555: result: yes
configure:4567: checking whether g++ supports -fexceptions
configure:4603: rm -rf SunWS_cache; g++ -o conftest -Wnon-virtual-dtor -Wno-long-long -Wundef -Wall -pedantic -W -Wpointer-arith -Wmissing-prototypes -Wwrite-strings -ansi -D_XOPEN_SOURCE=500 -D_BSD_SOURCE -Wcast-align -Wconversion -O2 -fno-exceptions -fno-check-new -fexceptions conftest.cc 1>&5
cc1plus: warning: command line option "-Wmissing-prototypes" is valid for Ada/C/ObjC/Pascal but not for C++
configure:4609: $? = 0
configure:4613: test -z
|| test ! -s conftest.err
configure:4616: $? = 0
configure:4619: test -s conftest
configure:4622: $? = 0
configure:4643: result: yes
configure:5304: checking how to run the C++ preprocessor
configure:5335: g++ -E conftest.cc
configure:5341: $? = 0
configure:5373: g++ -E conftest.cc
conftest.cc:14:28: error: ac_nonexistent.h: No such file or directory
configure:5379: $? = 1
configure: failed program was:
| /* confdefs.h. */
|
| #define PACKAGE_NAME ""
| #define PACKAGE_TARNAME ""
| #define PACKAGE_VERSION ""
| #define PACKAGE_STRING ""
| #define PACKAGE_BUGREPORT ""
| #define PACKAGE "kbirthday"
| #define VERSION "0.7.3"
| #ifdef __cplusplus
| extern "C" void std::exit (int) throw (); using std::exit;
| #endif
| /* end confdefs.h. */
| #include <ac_nonexistent.h>
configure:5418: result: g++ -E
configure:5442: g++ -E conftest.cc
configure:5448: $? = 0
configure:5480: g++ -E conftest.cc
conftest.cc:14:28: error: ac_nonexistent.h: No such file or directory
configure:5486: $? = 1
configure: failed program was:
| /* confdefs.h. */
|
| #define PACKAGE_NAME ""
| #define PACKAGE_TARNAME ""
| #define PACKAGE_VERSION ""
| #define PACKAGE_STRING ""
| #define PACKAGE_BUGREPORT ""
| #define PACKAGE "kbirthday"
| #define VERSION "0.7.3"
| #ifdef __cplusplus
| extern "C" void std::exit (int) throw (); using std::exit;
| #endif
| /* end confdefs.h. */
| #include <ac_nonexistent.h>
configure:5552: checking whether g++ supports -frepo
configure:5588: rm -rf SunWS_cache; g++ -o conftest -Wnon-virtual-dtor -Wno-long-long -Wundef -Wall -pedantic -W -Wpointer-arith -Wmissing-prototypes -Wwrite-strings -ansi -D_XOPEN_SOURCE=500 -D_BSD_SOURCE -Wcast-align -Wconversion -O2 -fno-exceptions -fno-check-new -frepo conftest.cc 1>&5
cc1plus: warning: command line option "-Wmissing-prototypes" is valid for Ada/C/ObjC/Pascal but not for C++
In file included from <built-in>:0:
<built-in>:0: warning: -frepo must be used with -c
configure:5594: $? = 0
configure:5598: test -z
|| test ! -s conftest.err
configure:5601: $? = 0
configure:5604: test -s conftest
configure:5607: $? = 0
configure:5628: result: yes
configure:5863: result: using lib directory suffix 64
configure:5902: checking for ld used by GCC
configure:5966: result: /usr/bin/ld
configure:5975: checking if the linker (/usr/bin/ld) is GNU ld
GNU ld (GNU Binutils for Ubuntu) 2.18
configure:5987: result: yes
configure:5992: checking for /usr/bin/ld option to reload object files
configure:5999: result: -r
configure:6008: checking for BSD-compatible nm
configure:6043: result: /usr/bin/nm -B
configure:6047: checking for a sed that does not truncate output
configure:6123: result:
configure:6126: checking whether ln -s works
configure:6130: result: yes
configure:6137: checking how to recognise dependant libraries
configure:6324: result: pass_all
configure:6394: gcc -c -ansi -W -Wall -pedantic -Wshadow -Wpointer-arith -Wmissing-prototypes -Wwrite-strings -D_XOPEN_SOURCE=500 -D_BSD_SOURCE -O2 conftest.c >&5
configure:6397: $? = 0
configure:6493: checking for egrep
configure:6503: result: grep -E
configure:6508: checking for ANSI C header files
configure:6533: gcc -c -ansi -W -Wall -pedantic -Wshadow -Wpointer-arith -Wmissing-prototypes -Wwrite-strings -D_XOPEN_SOURCE=500 -D_BSD_SOURCE -O2 conftest.c >&5
configure:6539: $? = 0
configure:6543: test -z
|| test ! -s conftest.err
configure:6546: $? = 0
configure:6549: test -s conftest.o
configure:6552: $? = 0
configure:6641: gcc -o conftest -ansi -W -Wall -pedantic -Wshadow -Wpointer-arith -Wmissing-prototypes -Wwrite-strings -D_XOPEN_SOURCE=500 -D_BSD_SOURCE -O2 conftest.c >&5
conftest.c: In function 'main':
conftest.c:33: warning: implicit declaration of function 'exit'
conftest.c:33: warning: incompatible implicit declaration of built-in function 'exit'
configure:6644: $? = 0
configure:6646: ./conftest
configure:6649: $? = 0
configure:6664: result: yes
configure:6688: checking for sys/types.h
configure:6704: gcc -c -ansi -W -Wall -pedantic -Wshadow -Wpointer-arith -Wmissing-prototypes -Wwrite-strings -D_XOPEN_SOURCE=500 -D_BSD_SOURCE -O2 conftest.c >&5
configure:6710: $? = 0
configure:6714: test -z
|| test ! -s conftest.err
configure:6717: $? = 0
configure:6720: test -s conftest.o
configure:6723: $? = 0
configure:6734: result: yes
configure:6688: checking for sys/stat.h
configure:6704: gcc -c -ansi -W -Wall -pedantic -Wshadow -Wpointer-arith -Wmissing-prototypes -Wwrite-strings -D_XOPEN_SOURCE=500 -D_BSD_SOURCE -O2 conftest.c >&5
configure:6710: $? = 0
configure:6714: test -z
|| test ! -s conftest.err
configure:6717: $? = 0
configure:6720: test -s conftest.o
configure:6723: $? = 0
configure:6734: result: yes
configure:6688: checking for stdlib.h
configure:6704: gcc -c -ansi -W -Wall -pedantic -Wshadow -Wpointer-arith -Wmissing-prototypes -Wwrite-strings -D_XOPEN_SOURCE=500 -D_BSD_SOURCE -O2 conftest.c >&5
configure:6710: $? = 0
configure:6714: test -z
|| test ! -s conftest.err
configure:6717: $? = 0
configure:6720: test -s conftest.o
configure:6723: $? = 0
configure:6734: result: yes
configure:6688: checking for string.h
configure:6704: gcc -c -ansi -W -Wall -pedantic -Wshadow -Wpointer-arith -Wmissing-prototypes -Wwrite-strings -D_XOPEN_SOURCE=500 -D_BSD_SOURCE -O2 conftest.c >&5
configure:6710: $? = 0
configure:6714: test -z
|| test ! -s conftest.err
configure:6717: $? = 0
configure:6720: test -s conftest.o
configure:6723: $? = 0
configure:6734: result: yes
configure:6688: checking for memory.h
configure:6704: gcc -c -ansi -W -Wall -pedantic -Wshadow -Wpointer-arith -Wmissing-prototypes -Wwrite-strings -D_XOPEN_SOURCE=500 -D_BSD_SOURCE -O2 conftest.c >&5
configure:6710: $? = 0
configure:6714: test -z
|| test ! -s conftest.err
configure:6717: $? = 0
configure:6720: test -s conftest.o
configure:6723: $? = 0
configure:6734: result: yes
configure:6688: checking for strings.h
configure:6704: gcc -c -ansi -W -Wall -pedantic -Wshadow -Wpointer-arith -Wmissing-prototypes -Wwrite-strings -D_XOPEN_SOURCE=500 -D_BSD_SOURCE -O2 conftest.c >&5
configure:6710: $? = 0
configure:6714: test -z
|| test ! -s conftest.err
configure:6717: $? = 0
configure:6720: test -s conftest.o
configure:6723: $? = 0
configure:6734: result: yes
configure:6688: checking for inttypes.h
configure:6704: gcc -c -ansi -W -Wall -pedantic -Wshadow -Wpointer-arith -Wmissing-prototypes -Wwrite-strings -D_XOPEN_SOURCE=500 -D_BSD_SOURCE -O2 conftest.c >&5
configure:6710: $? = 0
configure:6714: test -z
|| test ! -s conftest.err
configure:6717: $? = 0
configure:6720: test -s conftest.o
configure:6723: $? = 0
configure:6734: result: yes
configure:6688: checking for stdint.h
configure:6704: gcc -c -ansi -W -Wall -pedantic -Wshadow -Wpointer-arith -Wmissing-prototypes -Wwrite-strings -D_XOPEN_SOURCE=500 -D_BSD_SOURCE -O2 conftest.c >&5
configure:6710: $? = 0
configure:6714: test -z
|| test ! -s conftest.err
configure:6717: $? = 0
configure:6720: test -s conftest.o
configure:6723: $? = 0
configure:6734: result: yes
configure:6688: checking for unistd.h
configure:6704: gcc -c -ansi -W -Wall -pedantic -Wshadow -Wpointer-arith -Wmissing-prototypes -Wwrite-strings -D_XOPEN_SOURCE=500 -D_BSD_SOURCE -O2 conftest.c >&5
configure:6710: $? = 0
configure:6714: test -z
|| test ! -s conftest.err
configure:6717: $? = 0
configure:6720: test -s conftest.o
configure:6723: $? = 0
configure:6734: result: yes
configure:6760: checking dlfcn.h usability
configure:6772: gcc -c -ansi -W -Wall -pedantic -Wshadow -Wpointer-arith -Wmissing-prototypes -Wwrite-strings -D_XOPEN_SOURCE=500 -D_BSD_SOURCE -O2 conftest.c >&5
configure:6778: $? = 0
configure:6782: test -z
|| test ! -s conftest.err
configure:6785: $? = 0
configure:6788: test -s conftest.o
configure:6791: $? = 0
configure:6801: result: yes
configure:6805: checking dlfcn.h presence
configure:6815: gcc -E conftest.c
configure:6821: $? = 0
configure:6841: result: yes
configure:6876: checking for dlfcn.h
configure:6883: result: yes
configure:6900: checking the maximum length of command line arguments
configure:6948: result: 32768
configure:6959: checking command to parse /usr/bin/nm -B output from gcc object
configure:7044: gcc -c -ansi -W -Wall -pedantic -Wshadow -Wpointer-arith -Wmissing-prototypes -Wwrite-strings -D_XOPEN_SOURCE=500 -D_BSD_SOURCE -O2 conftest.c >&5
conftest.c:5: warning: no previous prototype for 'nm_test_func'
configure:7047: $? = 0
configure:7051: /usr/bin/nm -B conftest.o \| sed -n -e 's/^.*[ ]\([ABCDGISTW][ABCDGISTW]*\)[ ][ ]*\(\)\([_A-Za-z][_A-Za-z0-9]*\)$/\1 \2\3 \3/p' \> conftest.nm
configure:7054: $? = 0
configure:7106: gcc -o conftest -ansi -W -Wall -pedantic -Wshadow -Wpointer-arith -Wmissing-prototypes -Wwrite-strings -D_XOPEN_SOURCE=500 -D_BSD_SOURCE -O2 conftest.c conftstm.o >&5
configure:7109: $? = 0
configure:7147: result: ok
configure:7151: checking for objdir
configure:7166: result: .libs
configure:7256: checking for ranlib
configure:7272: found /usr/bin/ranlib
configure:7283: result: ranlib
configure:7336: checking for strip
configure:7352: found /usr/bin/strip
configure:7363: result: strip
configure:7626: checking if gcc static flag works
conftest.c:1: warning: return type defaults to 'int'
configure:7649: result: no
configure:7666: checking if gcc supports -fno-rtti -fno-exceptions
cc1: warning: command line option "-fno-rtti" is valid for C++/ObjC++ but not for C
cc1: warning: command line option "-fno-rtti" is valid for C++/ObjC++ but not for C
configure:7690: result: no
configure:7705: checking for gcc option to produce PIC
configure:7858: result: -fPIC
configure:7865: checking if gcc PIC flag -fPIC works
configure:7889: result: yes
configure:7913: checking if gcc supports -c -o file.o
configure:7954: result: yes
configure:7980: checking whether the gcc linker (/usr/bin/ld) supports shared libraries
configure:8783: result: yes
configure:8805: checking whether -lc should be explicitly linked in
configure:8810: gcc -c -ansi -W -Wall -pedantic -Wshadow -Wpointer-arith -Wmissing-prototypes -Wwrite-strings -D_XOPEN_SOURCE=500 -D_BSD_SOURCE -O2 conftest.c >&5
conftest.c:1: warning: 'dummy' defined but not used
configure:8813: $? = 0
configure:8827: gcc -shared conftest.o -v -Wl,-soname -Wl,conftest -o conftest 2\>\&1 \| grep -lc \>/dev/null 2\>\&1
configure:8830: $? = 0
configure:8842: result: no
configure:8848: checking how to hardcode library paths into programs
configure:8872: result: immediate
configure:8886: checking whether stripping libraries is possible
configure:8891: result: yes
configure:8898: checking dynamic linker characteristics
configure:9349: result: GNU/Linux ld.so
configure:10078: checking if libtool supports shared libraries
configure:10080: result: yes
configure:10083: checking whether to build shared libraries
configure:10104: result: yes
configure:10107: checking whether to build static libraries
configure:10111: result: no
configure:10190: creating libtool
configure:10915: checking whether the g++ linker (/usr/bin/ld) supports shared libraries
configure:11590: result: yes
configure:11607: g++ -c -Wnon-virtual-dtor -Wno-long-long -Wundef -Wall -pedantic -W -Wpointer-arith -Wmissing-prototypes -Wwrite-strings -ansi -D_XOPEN_SOURCE=500 -D_BSD_SOURCE -Wcast-align -Wconversion -O2 -fno-exceptions -fno-check-new conftest.cc >&5
cc1plus: warning: command line option "-Wmissing-prototypes" is valid for Ada/C/ObjC/Pascal but not for C++
configure:11610: $? = 0
configure:11710: checking for g++ option to produce PIC
configure:11946: result: -fPIC
configure:11953: checking if g++ PIC flag -fPIC works
cc1plus: warning: command line option "-Wmissing-prototypes" is valid for Ada/C/ObjC/Pascal but not for C++
configure:11977: result: no
configure:12001: checking if g++ supports -c -o file.o
cc1plus: warning: command line option "-Wmissing-prototypes" is valid for Ada/C/ObjC/Pascal but not for C++
configure:12042: result: no
configure:12068: checking whether the g++ linker (/usr/bin/ld) supports shared libraries
configure:12090: result: yes
configure:12112: checking whether -lc should be explicitly linked in
configure:12117: g++ -c -Wnon-virtual-dtor -Wno-long-long -Wundef -Wall -pedantic -W -Wpointer-arith -Wmissing-prototypes -Wwrite-strings -ansi -D_XOPEN_SOURCE=500 -D_BSD_SOURCE -Wcast-align -Wconversion -O2 -fno-exceptions -fno-check-new conftest.cc >&5
cc1plus: warning: command line option "-Wmissing-prototypes" is valid for Ada/C/ObjC/Pascal but not for C++
conftest.cc:1: warning: 'dummy' defined but not used
configure:12120: $? = 0
configure:12134: g++ -shared -nostdlib conftest.o -v -Wl,-soname -Wl,conftest -o conftest 2\>\&1 \| grep -lc \>/dev/null 2\>\&1
configure:12137: $? = 1
configure:12149: result: yes
configure:12155: checking how to hardcode library paths into programs
configure:12179: result: immediate
configure:12193: checking whether stripping libraries is possible
configure:12198: result: yes
configure:12205: checking dynamic linker characteristics
configure:12656: result: GNU/Linux ld.so
configure:13801: checking if gcj supports -fno-rtti -fno-exceptions
configure:13825: result: no
configure:13840: checking for gcj option to produce PIC
configure:13993: result: -fPIC
configure:14000: checking if gcj PIC flag -fPIC works
configure:14024: result: no
configure:14048: checking if gcj supports -c -o file.o
configure:14089: result: no
configure:14115: checking whether the gcj linker (/usr/bin/ld) supports shared libraries
configure:14918: result: yes
configure:14940: checking whether -lc should be explicitly linked in
configure:14945: gcj -c -ansi -W -Wall -pedantic -Wshadow -Wpointer-arith -Wmissing-prototypes -Wwrite-strings -D_XOPEN_SOURCE=500 -D_BSD_SOURCE -O2 conftest.java >&5
./configure: line 14946: gcj: command not found
configure:14948: $? = 127
configure:14977: result: yes
configure:14983: checking how to hardcode library paths into programs
configure:15007: result: immediate
configure:15021: checking whether stripping libraries is possible
configure:15026: result: yes
configure:15033: checking dynamic linker characteristics
configure:15484: result: GNU/Linux ld.so
configure:17105: checking for msgfmt
configure:17132: result: /usr/bin/msgfmt
configure:17141: checking for gmsgfmt
configure:17172: result: /usr/bin/msgfmt
configure:17191: checking for xgettext
configure:17218: result: /usr/bin/xgettext
configure:17317: checking for main in -lutil
configure:17341: gcc -o conftest -ansi -W -Wall -pedantic -Wshadow -Wpointer-arith -Wmissing-prototypes -Wwrite-strings -D_XOPEN_SOURCE=500 -D_BSD_SOURCE -O2 conftest.c -lutil >&5
configure:17347: $? = 0
configure:17351: test -z
|| test ! -s conftest.err
configure:17354: $? = 0
configure:17357: test -s conftest
configure:17360: $? = 0
configure:17373: result: yes
configure:17379: checking for main in -lcompat
configure:17403: gcc -o conftest -ansi -W -Wall -pedantic -Wshadow -Wpointer-arith -Wmissing-prototypes -Wwrite-strings -D_XOPEN_SOURCE=500 -D_BSD_SOURCE -O2 conftest.c -lcompat >&5
/usr/bin/ld: cannot find -lcompat
collect2: ld returned 1 exit status
configure:17409: $? = 1
configure: failed program was:
| /* confdefs.h. */
|
| #define PACKAGE_NAME ""
| #define PACKAGE_TARNAME ""
| #define PACKAGE_VERSION ""
| #define PACKAGE_STRING ""
| #define PACKAGE_BUGREPORT ""
| #define PACKAGE "kbirthday"
| #define VERSION "0.7.3"
| #ifdef __cplusplus
| extern "C" void std::exit (int) throw (); using std::exit;
| #endif
| #define HAVE_TEMPLATE_REPOSITORY 1
| #define KDELIBSUFF "\"64\""
| #define STDC_HEADERS 1
| #define HAVE_SYS_TYPES_H 1
| #define HAVE_SYS_STAT_H 1
| #define HAVE_STDLIB_H 1
| #define HAVE_STRING_H 1
| #define HAVE_MEMORY_H 1
| #define HAVE_STRINGS_H 1
| #define HAVE_INTTYPES_H 1
| #define HAVE_STDINT_H 1
| #define HAVE_UNISTD_H 1
| #define HAVE_DLFCN_H 1
| /* end confdefs.h. */
|
|
| int
| main ()
| {
| main ();
| ;
| return 0;
| }
configure:17435: result: no
configure:17442: checking for crypt in -lcrypt
configure:17472: gcc -o conftest -ansi -W -Wall -pedantic -Wshadow -Wpointer-arith -Wmissing-prototypes -Wwrite-strings -D_XOPEN_SOURCE=500 -D_BSD_SOURCE -O2 conftest.c -lcrypt >&5
configure:17478: $? = 0
configure:17482: test -z
|| test ! -s conftest.err
configure:17485: $? = 0
configure:17488: test -s conftest
configure:17491: $? = 0
configure:17504: result: yes
configure:17598: checking for socklen_t
configure:17637: g++ -c -Wnon-virtual-dtor -Wno-long-long -Wundef -Wall -pedantic -W -Wpointer-arith -Wmissing-prototypes -Wwrite-strings -ansi -D_XOPEN_SOURCE=500 -D_BSD_SOURCE -Wcast-align -Wconversion -O2 -fno-exceptions -fno-check-new conftest.cc >&5
cc1plus: warning: command line option "-Wmissing-prototypes" is valid for Ada/C/ObjC/Pascal but not for C++
configure:17643: $? = 0
configure:17647: test -z
|| test ! -s conftest.err
configure:17650: $? = 0
configure:17653: test -s conftest.o
configure:17656: $? = 0
configure:17728: result: socklen_t
configure:17750: checking for dnet_ntoa in -ldnet
configure:17780: gcc -o conftest -ansi -W -Wall -pedantic -Wshadow -Wpointer-arith -Wmissing-prototypes -Wwrite-strings -D_XOPEN_SOURCE=500 -D_BSD_SOURCE -O2 conftest.c -ldnet >&5
/usr/bin/ld: cannot find -ldnet
collect2: ld returned 1 exit status
configure:17786: $? = 1
configure: failed program was:
| /* confdefs.h. */
|
| #define PACKAGE_NAME ""
| #define PACKAGE_TARNAME ""
| #define PACKAGE_VERSION ""
| #define PACKAGE_STRING ""
| #define PACKAGE_BUGREPORT ""
| #define PACKAGE "kbirthday"
| #define VERSION "0.7.3"
| #ifdef __cplusplus
| extern "C" void std::exit (int) throw (); using std::exit;
| #endif
| #define HAVE_TEMPLATE_REPOSITORY 1
| #define KDELIBSUFF "\"64\""
| #define STDC_HEADERS 1
| #define HAVE_SYS_TYPES_H 1
| #define HAVE_SYS_STAT_H 1
| #define HAVE_STDLIB_H 1
| #define HAVE_STRING_H 1
| #define HAVE_MEMORY_H 1
| #define HAVE_STRINGS_H 1
| #define HAVE_INTTYPES_H 1
| #define HAVE_STDINT_H 1
| #define HAVE_UNISTD_H 1
| #define HAVE_DLFCN_H 1
| #define HAVE_CRYPT 1
| #define ksize_t socklen_t
| /* end confdefs.h. */
|
| /* Override any gcc2 internal prototype to avoid an error. */
| #ifdef __cplusplus
| extern "C"
| #endif
| /* We use char because int might match the return type of a gcc2
| builtin and then its argument prototype would still apply. */
| char dnet_ntoa ();
| int
| main ()
| {
| dnet_ntoa ();
| ;
| return 0;
| }
configure:17812: result: no
configure:17819: checking for dnet_ntoa in -ldnet_stub
configure:17849: gcc -o conftest -ansi -W -Wall -pedantic -Wshadow -Wpointer-arith -Wmissing-prototypes -Wwrite-strings -D_XOPEN_SOURCE=500 -D_BSD_SOURCE -O2 conftest.c -ldnet_stub >&5
/usr/bin/ld: cannot find -ldnet_stub
collect2: ld returned 1 exit status
configure:17855: $? = 1
configure: failed program was:
| /* confdefs.h. */
|
| #define PACKAGE_NAME ""
| #define PACKAGE_TARNAME ""
| #define PACKAGE_VERSION ""
| #define PACKAGE_STRING ""
| #define PACKAGE_BUGREPORT ""
| #define PACKAGE "kbirthday"
| #define VERSION "0.7.3"
| #ifdef __cplusplus
| extern "C" void std::exit (int) throw (); using std::exit;
| #endif
| #define HAVE_TEMPLATE_REPOSITORY 1
| #define KDELIBSUFF "\"64\""
| #define STDC_HEADERS 1
| #define HAVE_SYS_TYPES_H 1
| #define HAVE_SYS_STAT_H 1
| #define HAVE_STDLIB_H 1
| #define HAVE_STRING_H 1
| #define HAVE_MEMORY_H 1
| #define HAVE_STRINGS_H 1
| #define HAVE_INTTYPES_H 1
| #define HAVE_STDINT_H 1
| #define HAVE_UNISTD_H 1
| #define HAVE_DLFCN_H 1
| #define HAVE_CRYPT 1
| #define ksize_t socklen_t
| /* end confdefs.h. */
|
| /* Override any gcc2 internal prototype to avoid an error. */
| #ifdef __cplusplus
| extern "C"
| #endif
| /* We use char because int might match the return type of a gcc2
| builtin and then its argument prototype would still apply. */
| char dnet_ntoa ();
| int
| main ()
| {
| dnet_ntoa ();
| ;
| return 0;
| }
configure:17881: result: no
configure:17888: checking for inet_ntoa
configure:17945: gcc -o conftest -ansi -W -Wall -pedantic -Wshadow -Wpointer-arith -Wmissing-prototypes -Wwrite-strings -D_XOPEN_SOURCE=500 -D_BSD_SOURCE -O2 conftest.c >&5
configure:17951: $? = 0
configure:17955: test -z
|| test ! -s conftest.err
configure:17958: $? = 0
configure:17961: test -s conftest
configure:17964: $? = 0
configure:17976: result: yes
configure:18049: checking for connect
configure:18106: gcc -o conftest -ansi -W -Wall -pedantic -Wshadow -Wpointer-arith -Wmissing-prototypes -Wwrite-strings -D_XOPEN_SOURCE=500 -D_BSD_SOURCE -O2 conftest.c >&5
configure:18112: $? = 0
configure:18116: test -z
|| test ! -s conftest.err
configure:18119: $? = 0
configure:18122: test -s conftest
configure:18125: $? = 0
configure:18137: result: yes
configure:18211: checking for remove
configure:18268: gcc -o conftest -ansi -W -Wall -pedantic -Wshadow -Wpointer-arith -Wmissing-prototypes -Wwrite-strings -D_XOPEN_SOURCE=500 -D_BSD_SOURCE -O2 conftest.c >&5
configure:18274: $? = 0
configure:18278: test -z
|| test ! -s conftest.err
configure:18281: $? = 0
configure:18284: test -s conftest
configure:18287: $? = 0
configure:18299: result: yes
configure:18374: checking for shmat
configure:18431: gcc -o conftest -ansi -W -Wall -pedantic -Wshadow -Wpointer-arith -Wmissing-prototypes -Wwrite-strings -D_XOPEN_SOURCE=500 -D_BSD_SOURCE -O2 conftest.c >&5
configure:18437: $? = 0
configure:18441: test -z
|| test ! -s conftest.err
configure:18444: $? = 0
configure:18447: test -s conftest
configure:18450: $? = 0
configure:18462: result: yes
configure:18553: checking crt_externs.h usability
configure:18565: gcc -c -ansi -W -Wall -pedantic -Wshadow -Wpointer-arith -Wmissing-prototypes -Wwrite-strings -D_XOPEN_SOURCE=500 -D_BSD_SOURCE -O2 conftest.c >&5
conftest.c:63:25: error: crt_externs.h: No such file or directory
configure:18571: $? = 1
configure: failed program was:
| /* confdefs.h. */
|
| #define PACKAGE_NAME ""
| #define PACKAGE_TARNAME ""
| #define PACKAGE_VERSION ""
| #define PACKAGE_STRING ""
| #define PACKAGE_BUGREPORT ""
| #define PACKAGE "kbirthday"
| #define VERSION "0.7.3"
| #ifdef __cplusplus
| extern "C" void std::exit (int) throw (); using std::exit;
| #endif
| #define HAVE_TEMPLATE_REPOSITORY 1
| #define KDELIBSUFF "\"64\""
| #define STDC_HEADERS 1
| #define HAVE_SYS_TYPES_H 1
| #define HAVE_SYS_STAT_H 1
| #define HAVE_STDLIB_H 1
| #define HAVE_STRING_H 1
| #define HAVE_MEMORY_H 1
| #define HAVE_STRINGS_H 1
| #define HAVE_INTTYPES_H 1
| #define HAVE_STDINT_H 1
| #define HAVE_UNISTD_H 1
| #define HAVE_DLFCN_H 1
| #define HAVE_CRYPT 1
| #define ksize_t socklen_t
| /* end confdefs.h. */
| #include <stdio.h>
| #if HAVE_SYS_TYPES_H
| # include <sys/types.h>
| #endif
| #if HAVE_SYS_STAT_H
| # include <sys/stat.h>
| #endif
| #if STDC_HEADERS
| # include <stdlib.h>
| # include <stddef.h>
| #else
| # if HAVE_STDLIB_H
| # include <stdlib.h>
| # endif
| #endif
| #if HAVE_STRING_H
| # if !STDC_HEADERS && HAVE_MEMORY_H
| # include <memory.h>
| # endif
| # include <string.h>
| #endif
| #if HAVE_STRINGS_H
| # include <strings.h>
| #endif
| #if HAVE_INTTYPES_H
| # include <inttypes.h>
| #else
| # if HAVE_STDINT_H
| # include <stdint.h>
| # endif
| #endif
| #if HAVE_UNISTD_H
| # include <unistd.h>
| #endif
| #include <crt_externs.h>
configure:18594: result: no
configure:18598: checking crt_externs.h presence
configure:18608: gcc -E conftest.c
conftest.c:29:25: error: crt_externs.h: No such file or directory
configure:18614: $? = 1
configure: failed program was:
| /* confdefs.h. */
|
| #define PACKAGE_NAME ""
| #define PACKAGE_TARNAME ""
| #define PACKAGE_VERSION ""
| #define PACKAGE_STRING ""
| #define PACKAGE_BUGREPORT ""
| #define PACKAGE "kbirthday"
| #define VERSION "0.7.3"
| #ifdef __cplusplus
| extern "C" void std::exit (int) throw (); using std::exit;
| #endif
| #define HAVE_TEMPLATE_REPOSITORY 1
| #define KDELIBSUFF "\"64\""
| #define STDC_HEADERS 1
| #define HAVE_SYS_TYPES_H 1
| #define HAVE_SYS_STAT_H 1
| #define HAVE_STDLIB_H 1
| #define HAVE_STRING_H 1
| #define HAVE_MEMORY_H 1
| #define HAVE_STRINGS_H 1
| #define HAVE_INTTYPES_H 1
| #define HAVE_STDINT_H 1
| #define HAVE_UNISTD_H 1
| #define HAVE_DLFCN_H 1
| #define HAVE_CRYPT 1
| #define ksize_t socklen_t
| /* end confdefs.h. */
| #include <crt_externs.h>
configure:18634: result: no
configure:18669: checking for crt_externs.h
configure:18676: result: no
configure:18689: checking for _NSGetEnviron
configure:18746: gcc -o conftest -ansi -W -Wall -pedantic -Wshadow -Wpointer-arith -Wmissing-prototypes -Wwrite-strings -D_XOPEN_SOURCE=500 -D_BSD_SOURCE -O2 conftest.c >&5
/tmp/ccmBehFu.o: In function `main':
conftest.c:(.text+0x17): undefined reference to `_NSGetEnviron'
/tmp/ccmBehFu.o:(.data+0x0): undefined reference to `_NSGetEnviron'
collect2: ld returned 1 exit status
configure:18752: $? = 1
configure: failed program was:
| /* confdefs.h. */
|
| #define PACKAGE_NAME ""
| #define PACKAGE_TARNAME ""
| #define PACKAGE_VERSION ""
| #define PACKAGE_STRING ""
| #define PACKAGE_BUGREPORT ""
| #define PACKAGE "kbirthday"
| #define VERSION "0.7.3"
| #ifdef __cplusplus
| extern "C" void std::exit (int) throw (); using std::exit;
| #endif
| #define HAVE_TEMPLATE_REPOSITORY 1
| #define KDELIBSUFF "\"64\""
| #define STDC_HEADERS 1
| #define HAVE_SYS_TYPES_H 1
| #define HAVE_SYS_STAT_H 1
| #define HAVE_STDLIB_H 1
| #define HAVE_STRING_H 1
| #define HAVE_MEMORY_H 1
| #define HAVE_STRINGS_H 1
| #define HAVE_INTTYPES_H 1
| #define HAVE_STDINT_H 1
| #define HAVE_UNISTD_H 1
| #define HAVE_DLFCN_H 1
| #define HAVE_CRYPT 1
| #define ksize_t socklen_t
| /* end confdefs.h. */
| /* Define _NSGetEnviron to an innocuous variant, in case <limits.h> declares _NSGetEnviron.
| For example, HP-UX 11i <limits.h> declares gettimeofday. */
| #define _NSGetEnviron innocuous__NSGetEnviron
|
| /* System header to define __stub macros and hopefully few prototypes,
| which can conflict with char _NSGetEnviron (); below.
| Prefer <limits.h> to <assert.h> if __STDC__ is defined, since
| <limits.h> exists even on freestanding compilers. */
|
| #ifdef __STDC__
| # include <limits.h>
| #else
| # include <assert.h>
| #endif
|
| #undef _NSGetEnviron
|
| /* Override any gcc2 internal prototype to avoid an error. */
| #ifdef __cplusplus
| extern "C"
| {
| #endif
| /* We use char because int might match the return type of a gcc2
| builtin and then its argument prototype would still apply. */
| char _NSGetEnviron ();
| /* The GNU C library defines this for functions which it implements
| to always fail with ENOSYS. Some functions are actually named
| something starting with __ and the normal name is an alias. */
| #if defined (__stub__NSGetEnviron) || defined (__stub____NSGetEnviron)
| choke me
| #else
| char (*f) () = _NSGetEnviron;
| #endif
| #ifdef __cplusplus
| }
| #endif
|
| int
| main ()
| {
| return f != _NSGetEnviron;
| ;
| return 0;
| }
configure:18777: result: no
configure:18795: checking for sys/types.h
configure:18800: result: yes
configure:18795: checking for stdint.h
configure:18800: result: yes
configure:18942: checking for poll in -lpoll
configure:18972: gcc -o conftest -ansi -W -Wall -pedantic -Wshadow -Wpointer-arith -Wmissing-prototypes -Wwrite-strings -D_XOPEN_SOURCE=500 -D_BSD_SOURCE -O2 conftest.c -lpoll >&5
/usr/bin/ld: cannot find -lpoll
collect2: ld returned 1 exit status
configure:18978: $? = 1
configure: failed program was:
| /* confdefs.h. */
|
| #define PACKAGE_NAME ""
| #define PACKAGE_TARNAME ""
| #define PACKAGE_VERSION ""
| #define PACKAGE_STRING ""
| #define PACKAGE_BUGREPORT ""
| #define PACKAGE "kbirthday"
| #define VERSION "0.7.3"
| #ifdef __cplusplus
| extern "C" void std::exit (int) throw (); using std::exit;
| #endif
| #define HAVE_TEMPLATE_REPOSITORY 1
| #define KDELIBSUFF "\"64\""
| #define STDC_HEADERS 1
| #define HAVE_SYS_TYPES_H 1
| #define HAVE_SYS_STAT_H 1
| #define HAVE_STDLIB_H 1
| #define HAVE_STRING_H 1
| #define HAVE_MEMORY_H 1
| #define HAVE_STRINGS_H 1
| #define HAVE_INTTYPES_H 1
| #define HAVE_STDINT_H 1
| #define HAVE_UNISTD_H 1
| #define HAVE_DLFCN_H 1
| #define HAVE_CRYPT 1
| #define ksize_t socklen_t
| #define HAVE_SYS_TYPES_H 1
| #define HAVE_STDINT_H 1
| /* end confdefs.h. */
|
| /* Override any gcc2 internal prototype to avoid an error. */
| #ifdef __cplusplus
| extern "C"
| #endif
| /* We use char because int might match the return type of a gcc2
| builtin and then its argument prototype would still apply. */
| char poll ();
| int
| main ()
| {
| poll ();
| ;
| return 0;
| }
configure:19004: result: no
configure:19022: checking CoreAudio/CoreAudio.h usability
configure:19034: gcc -c -ansi -W -Wall -pedantic -Wshadow -Wpointer-arith -Wmissing-prototypes -Wwrite-strings -D_XOPEN_SOURCE=500 -D_BSD_SOURCE -O2 conftest.c >&5
conftest.c:65:33: error: CoreAudio/CoreAudio.h: No such file or directory
configure:19040: $? = 1
configure: failed program was:
| /* confdefs.h. */
|
| #define PACKAGE_NAME ""
| #define PACKAGE_TARNAME ""
| #define PACKAGE_VERSION ""
| #define PACKAGE_STRING ""
| #define PACKAGE_BUGREPORT ""
| #define PACKAGE "kbirthday"
| #define VERSION "0.7.3"
| #ifdef __cplusplus
| extern "C" void std::exit (int) throw (); using std::exit;
| #endif
| #define HAVE_TEMPLATE_REPOSITORY 1
| #define KDELIBSUFF "\"64\""
| #define STDC_HEADERS 1
| #define HAVE_SYS_TYPES_H 1
| #define HAVE_SYS_STAT_H 1
| #define HAVE_STDLIB_H 1
| #define HAVE_STRING_H 1
| #define HAVE_MEMORY_H 1
| #define HAVE_STRINGS_H 1
| #define HAVE_INTTYPES_H 1
| #define HAVE_STDINT_H 1
| #define HAVE_UNISTD_H 1
| #define HAVE_DLFCN_H 1
| #define HAVE_CRYPT 1
| #define ksize_t socklen_t
| #define HAVE_SYS_TYPES_H 1
| #define HAVE_STDINT_H 1
| /* end confdefs.h. */
| #include <stdio.h>
| #if HAVE_SYS_TYPES_H
| # include <sys/types.h>
| #endif
| #if HAVE_SYS_STAT_H
| # include <sys/stat.h>
| #endif
| #if STDC_HEADERS
| # include <stdlib.h>
| # include <stddef.h>
| #else
| # if HAVE_STDLIB_H
| # include <stdlib.h>
| # endif
| #endif
| #if HAVE_STRING_H
| # if !STDC_HEADERS && HAVE_MEMORY_H
| # include <memory.h>
| # endif
| # include <string.h>
| #endif
| #if HAVE_STRINGS_H
| # include <strings.h>
| #endif
| #if HAVE_INTTYPES_H
| # include <inttypes.h>
| #else
| # if HAVE_STDINT_H
| # include <stdint.h>
| # endif
| #endif
| #if HAVE_UNISTD_H
| # include <unistd.h>
| #endif
| #include <CoreAudio/CoreAudio.h>
configure:19063: result: no
configure:19067: checking CoreAudio/CoreAudio.h presence
configure:19077: gcc -E conftest.c
conftest.c:31:33: error: CoreAudio/CoreAudio.h: No such file or directory
configure:19083: $? = 1
configure: failed program was:
| /* confdefs.h. */
|
| #define PACKAGE_NAME ""
| #define PACKAGE_TARNAME ""
| #define PACKAGE_VERSION ""
| #define PACKAGE_STRING ""
| #define PACKAGE_BUGREPORT ""
| #define PACKAGE "kbirthday"
| #define VERSION "0.7.3"
| #ifdef __cplusplus
| extern "C" void std::exit (int) throw (); using std::exit;
| #endif
| #define HAVE_TEMPLATE_REPOSITORY 1
| #define KDELIBSUFF "\"64\""
| #define STDC_HEADERS 1
| #define HAVE_SYS_TYPES_H 1
| #define HAVE_SYS_STAT_H 1
| #define HAVE_STDLIB_H 1
| #define HAVE_STRING_H 1
| #define HAVE_MEMORY_H 1
| #define HAVE_STRINGS_H 1
| #define HAVE_INTTYPES_H 1
| #define HAVE_STDINT_H 1
| #define HAVE_UNISTD_H 1
| #define HAVE_DLFCN_H 1
| #define HAVE_CRYPT 1
| #define ksize_t socklen_t
| #define HAVE_SYS_TYPES_H 1
| #define HAVE_STDINT_H 1
| /* end confdefs.h. */
| #include <CoreAudio/CoreAudio.h>
configure:19103: result: no
configure:19138: checking for CoreAudio/CoreAudio.h
configure:19145: result: no
configure:19164: checking for res_init
configure:19211: g++ -c -Wnon-virtual-dtor -Wno-long-long -Wundef -Wall -pedantic -W -Wpointer-arith -Wmissing-prototypes -Wwrite-strings -ansi -D_XOPEN_SOURCE=500 -D_BSD_SOURCE -Wcast-align -Wconversion -O2 -fno-exceptions -fno-check-new -pedantic-errors conftest.cc >&5
cc1plus: warning: command line option "-Wmissing-prototypes" is valid for Ada/C/ObjC/Pascal but not for C++
configure:19217: $? = 0
configure:19221: test -z
|| test ! -s conftest.err
configure:19224: $? = 0
configure:19227: test -s conftest.o
configure:19230: $? = 0
configure:19252: result: yes
configure:19255: checking if res_init needs custom prototype
configure:19358: result: no
configure:19387: checking for killpg in -lucb
configure:19417: gcc -o conftest -ansi -W -Wall -pedantic -Wshadow -Wpointer-arith -Wmissing-prototypes -Wwrite-strings -D_XOPEN_SOURCE=500 -D_BSD_SOURCE -O2 conftest.c -lucb >&5
/usr/bin/ld: cannot find -lucb
collect2: ld returned 1 exit status
configure:19423: $? = 1
configure: failed program was:
| /* confdefs.h. */
|
| #define PACKAGE_NAME ""
| #define PACKAGE_TARNAME ""
| #define PACKAGE_VERSION ""
| #define PACKAGE_STRING ""
| #define PACKAGE_BUGREPORT ""
| #define PACKAGE "kbirthday"
| #define VERSION "0.7.3"
| #ifdef __cplusplus
| extern "C" void std::exit (int) throw (); using std::exit;
| #endif
| #define HAVE_TEMPLATE_REPOSITORY 1
| #define KDELIBSUFF "\"64\""
| #define STDC_HEADERS 1
| #define HAVE_SYS_TYPES_H 1
| #define HAVE_SYS_STAT_H 1
| #define HAVE_STDLIB_H 1
| #define HAVE_STRING_H 1
| #define HAVE_MEMORY_H 1
| #define HAVE_STRINGS_H 1
| #define HAVE_INTTYPES_H 1
| #define HAVE_STDINT_H 1
| #define HAVE_UNISTD_H 1
| #define HAVE_DLFCN_H 1
| #define HAVE_CRYPT 1
| #define ksize_t socklen_t
| #define HAVE_SYS_TYPES_H 1
| #define HAVE_STDINT_H 1
| #define HAVE_RES_INIT 1
| #define HAVE_RES_INIT_PROTO 1
| /* end confdefs.h. */
|
| /* Override any gcc2 internal prototype to avoid an error. */
| #ifdef __cplusplus
| extern "C"
| #endif
| /* We use char because int might match the return type of a gcc2
| builtin and then its argument prototype would still apply. */
| char killpg ();
| int
| main ()
| {
| killpg ();
| ;
| return 0;
| }
configure:19449: result: no
configure:19532: checking for int
configure:19556: gcc -c -ansi -W -Wall -pedantic -Wshadow -Wpointer-arith -Wmissing-prototypes -Wwrite-strings -D_XOPEN_SOURCE=500 -D_BSD_SOURCE -O2 conftest.c >&5
configure:19562: $? = 0
configure:19566: test -z
|| test ! -s conftest.err
configure:19569: $? = 0
configure:19572: test -s conftest.o
configure:19575: $? = 0
configure:19586: result: yes
configure:19589: checking size of int
configure:19908: gcc -o conftest -ansi -W -Wall -pedantic -Wshadow -Wpointer-arith -Wmissing-prototypes -Wwrite-strings -D_XOPEN_SOURCE=500 -D_BSD_SOURCE -O2 conftest.c >&5
conftest.c:67: warning: no previous prototype for 'longval'
conftest.c:68: warning: no previous prototype for 'ulongval'
configure:19911: $? = 0
configure:19913: ./conftest
configure:19916: $? = 0
configure:19939: result: 4
configure:19945: checking for long
configure:19969: gcc -c -ansi -W -Wall -pedantic -Wshadow -Wpointer-arith -Wmissing-prototypes -Wwrite-strings -D_XOPEN_SOURCE=500 -D_BSD_SOURCE -O2 conftest.c >&5
configure:19975: $? = 0
configure:19979: test -z
|| test ! -s conftest.err
configure:19982: $? = 0
configure:19985: test -s conftest.o
configure:19988: $? = 0
configure:19999: result: yes
configure:20002: checking size of long
configure:20321: gcc -o conftest -ansi -W -Wall -pedantic -Wshadow -Wpointer-arith -Wmissing-prototypes -Wwrite-strings -D_XOPEN_SOURCE=500 -D_BSD_SOURCE -O2 conftest.c >&5
conftest.c:68: warning: no previous prototype for 'longval'
conftest.c:69: warning: no previous prototype for 'ulongval'
configure:20324: $? = 0
configure:20326: ./conftest
configure:20329: $? = 0
configure:20352: result: 4
configure:20358: checking for char *
configure:20382: gcc -c -ansi -W -Wall -pedantic -Wshadow -Wpointer-arith -Wmissing-prototypes -Wwrite-strings -D_XOPEN_SOURCE=500 -D_BSD_SOURCE -O2 conftest.c >&5
configure:20388: $? = 0
configure:20392: test -z
|| test ! -s conftest.err
configure:20395: $? = 0
configure:20398: test -s conftest.o
configure:20401: $? = 0
configure:20412: result: yes
configure:20415: checking size of char *
configure:20734: gcc -o conftest -ansi -W -Wall -pedantic -Wshadow -Wpointer-arith -Wmissing-prototypes -Wwrite-strings -D_XOPEN_SOURCE=500 -D_BSD_SOURCE -O2 conftest.c >&5
conftest.c:69: warning: no previous prototype for 'longval'
conftest.c:70: warning: no previous prototype for 'ulongval'
configure:20737: $? = 0
configure:20739: ./conftest
configure:20742: $? = 0
configure:20765: result: 4
configure:20771: checking for char
configure:20795: gcc -c -ansi -W -Wall -pedantic -Wshadow -Wpointer-arith -Wmissing-prototypes -Wwrite-strings -D_XOPEN_SOURCE=500 -D_BSD_SOURCE -O2 conftest.c >&5
configure:20801: $? = 0
configure:20805: test -z
|| test ! -s conftest.err
configure:20808: $? = 0
configure:20811: test -s conftest.o
configure:20814: $? = 0
configure:20825: result: yes
configure:20828: checking size of char
configure:21147: gcc -o conftest -ansi -W -Wall -pedantic -Wshadow -Wpointer-arith -Wmissing-prototypes -Wwrite-strings -D_XOPEN_SOURCE=500 -D_BSD_SOURCE -O2 conftest.c >&5
conftest.c:70: warning: no previous prototype for 'longval'
conftest.c:71: warning: no previous prototype for 'ulongval'
configure:21150: $? = 0
configure:21152: ./conftest
configure:21155: $? = 0
configure:21178: result: 1
configure:21186: checking for dlopen in -ldl
configure:21216: gcc -o conftest -ansi -W -Wall -pedantic -Wshadow -Wpointer-arith -Wmissing-prototypes -Wwrite-strings -D_XOPEN_SOURCE=500 -D_BSD_SOURCE -O2 conftest.c -ldl >&5
configure:21222: $? = 0
configure:21226: test -z
|| test ! -s conftest.err
configure:21229: $? = 0
configure:21232: test -s conftest
configure:21235: $? = 0
configure:21248: result: yes
configure:21258: checking for shl_unload in -ldld
configure:21288: gcc -o conftest -ansi -W -Wall -pedantic -Wshadow -Wpointer-arith -Wmissing-prototypes -Wwrite-strings -D_XOPEN_SOURCE=500 -D_BSD_SOURCE -O2 conftest.c -ldld >&5
/usr/bin/ld: cannot find -ldld
collect2: ld returned 1 exit status
configure:21294: $? = 1
configure: failed program was:
| /* confdefs.h. */
|
| #define PACKAGE_NAME ""
| #define PACKAGE_TARNAME ""
| #define PACKAGE_VERSION ""
| #define PACKAGE_STRING ""
| #define PACKAGE_BUGREPORT ""
| #define PACKAGE "kbirthday"
| #define VERSION "0.7.3"
| #ifdef __cplusplus
| extern "C" void std::exit (int) throw (); using std::exit;
| #endif
| #define HAVE_TEMPLATE_REPOSITORY 1
| #define KDELIBSUFF "\"64\""
| #define STDC_HEADERS 1
| #define HAVE_SYS_TYPES_H 1
| #define HAVE_SYS_STAT_H 1
| #define HAVE_STDLIB_H 1
| #define HAVE_STRING_H 1
| #define HAVE_MEMORY_H 1
| #define HAVE_STRINGS_H 1
| #define HAVE_INTTYPES_H 1
| #define HAVE_STDINT_H 1
| #define HAVE_UNISTD_H 1
| #define HAVE_DLFCN_H 1
| #define HAVE_CRYPT 1
| #define ksize_t socklen_t
| #define HAVE_SYS_TYPES_H 1
| #define HAVE_STDINT_H 1
| #define HAVE_RES_INIT 1
| #define HAVE_RES_INIT_PROTO 1
| #define SIZEOF_INT 4
| #define SIZEOF_LONG 4
| #define SIZEOF_CHAR_P 4
| #define SIZEOF_CHAR 1
| /* end confdefs.h. */
|
| /* Override any gcc2 internal prototype to avoid an error. */
| #ifdef __cplusplus
| extern "C"
| #endif
| /* We use char because int might match the return type of a gcc2
| builtin and then its argument prototype would still apply. */
| char shl_unload ();
| int
| main ()
| {
| shl_unload ();
| ;
| return 0;
| }
configure:21320: result: no
configure:21341: checking for vsnprintf
configure:21398: gcc -o conftest -ansi -W -Wall -pedantic -Wshadow -Wpointer-arith -Wmissing-prototypes -Wwrite-strings -D_XOPEN_SOURCE=500 -D_BSD_SOURCE -O2 conftest.c >&5
configure:21404: $? = 0
configure:21408: test -z
|| test ! -s conftest.err
configure:21411: $? = 0
configure:21414: test -s conftest
configure:21417: $? = 0
configure:21429: result: yes
configure:21341: checking for snprintf
configure:21398: gcc -o conftest -ansi -W -Wall -pedantic -Wshadow -Wpointer-arith -Wmissing-prototypes -Wwrite-strings -D_XOPEN_SOURCE=500 -D_BSD_SOURCE -O2 conftest.c >&5
configure:21404: $? = 0
configure:21408: test -z
|| test ! -s conftest.err
configure:21411: $? = 0
configure:21414: test -s conftest
configure:21417: $? = 0
configure:21429: result: yes
configure:21467: checking for X
configure:21512: gcc -E conftest.c
configure:21518: $? = 0
configure:21609: gcc -o conftest -ansi -W -Wall -pedantic -Wshadow -Wpointer-arith -Wmissing-prototypes -Wwrite-strings -D_XOPEN_SOURCE=500 -D_BSD_SOURCE -O2 conftest.c -lXt >&5
conftest.c: In function 'main':
conftest.c:43: warning: implicit declaration of function 'XtMalloc'
configure:21615: $? = 0
configure:21619: test -z
|| test ! -s conftest.err
configure:21622: $? = 0
configure:21625: test -s conftest
configure:21628: $? = 0
configure:21774: result: libraries /usr/lib64, headers .
configure:21808: checking for IceConnectionNumber in -lICE
configure:21838: gcc -o conftest -ansi -W -Wall -pedantic -Wshadow -Wpointer-arith -Wmissing-prototypes -Wwrite-strings -D_XOPEN_SOURCE=500 -D_BSD_SOURCE -O2 -L/usr/lib64 conftest.c -lICE >&5
/usr/bin/ld: skipping incompatible /usr/lib64/libc.so when searching for -lc
/usr/bin/ld: skipping incompatible /usr/lib64/libc.a when searching for -lc
configure:21844: $? = 0
configure:21848: test -z
|| test ! -s conftest.err
configure:21851: $? = 0
configure:21854: test -s conftest
configure:21857: $? = 0
configure:21870: result: yes
configure:21884: checking for libXext
configure:21919: gcc -o conftest -ansi -W -Wall -pedantic -Wshadow -Wpointer-arith -Wmissing-prototypes -Wwrite-strings -D_XOPEN_SOURCE=500 -D_BSD_SOURCE -O2 -L/usr/lib64 conftest.c -lXext -lX11 >&5
/usr/bin/ld: skipping incompatible /usr/lib64/libc.so when searching for -lc
/usr/bin/ld: skipping incompatible /usr/lib64/libc.a when searching for -lc
configure:21925: $? = 0
configure:21929: test -z
|| test ! -s conftest.err
configure:21932: $? = 0
configure:21935: test -s conftest
configure:21938: $? = 0
configure:21957: result: yes
configure:21970: checking for Xinerama
configure:22054: result: no
configure:22110: checking for pthread_create in -lpthread
configure:22140: gcc -o conftest -ansi -W -Wall -pedantic -Wshadow -Wpointer-arith -Wmissing-prototypes -Wwrite-strings -D_XOPEN_SOURCE=500 -D_BSD_SOURCE -O2 conftest.c -lpthread >&5
configure:22146: $? = 0
configure:22150: test -z
|| test ! -s conftest.err
configure:22153: $? = 0
configure:22156: test -s conftest
configure:22159: $? = 0
configure:22172: result: yes
configure:22630: checking for extra includes
configure:22658: result: no
configure:22662: checking for extra libs
configure:22691: result: no
configure:22697: checking for libz
configure:22731: gcc -o conftest -ansi -W -Wall -pedantic -Wshadow -Wpointer-arith -Wmissing-prototypes -Wwrite-strings -D_XOPEN_SOURCE=500 -D_BSD_SOURCE -O2 -I. -D_REENTRANT conftest.c -L/usr/lib64 -lz >&5
/usr/bin/ld: skipping incompatible /usr/lib64/libc.so when searching for -lc
/usr/bin/ld: skipping incompatible /usr/lib64/libc.a when searching for -lc
configure:22737: $? = 0
configure:22741: test -z
|| test ! -s conftest.err
configure:22744: $? = 0
configure:22747: test -s conftest
configure:22750: $? = 0
configure:22773: result: -lz
configure:22786: checking for libpng
configure:22828: gcc -o conftest -ansi -W -Wall -pedantic -Wshadow -Wpointer-arith -Wmissing-prototypes -Wwrite-strings -D_XOPEN_SOURCE=500 -D_BSD_SOURCE -O2 -I. -D_REENTRANT conftest.c -L/usr/lib64 -lpng -lz -lm -lX11 >&5
/usr/bin/ld: skipping incompatible /usr/lib64/libm.so when searching for -lm
/usr/bin/ld: skipping incompatible /usr/lib64/libm.a when searching for -lm
/usr/bin/ld: skipping incompatible /usr/lib64/libc.so when searching for -lc
/usr/bin/ld: skipping incompatible /usr/lib64/libc.a when searching for -lc
configure:22834: $? = 0
configure:22838: test -z
|| test ! -s conftest.err
configure:22841: $? = 0
configure:22844: test -s conftest
configure:22847: $? = 0
configure:22871: result: -lpng -lz -lm
configure:22882: checking for libjpeg6b
configure:22928: gcc -o conftest -ansi -W -Wall -pedantic -Wshadow -Wpointer-arith -Wmissing-prototypes -Wwrite-strings -D_XOPEN_SOURCE=500 -D_BSD_SOURCE -O2 -I. -D_REENTRANT conftest.c -L/usr/lib64 -ljpeg6b -lm >&5
/usr/bin/ld: cannot find -ljpeg6b
collect2: ld returned 1 exit status
configure:22934: $? = 1
configure: failed program was:
| /* confdefs.h. */
|
| #define PACKAGE_NAME ""
| #define PACKAGE_TARNAME ""
| #define PACKAGE_VERSION ""
| #define PACKAGE_STRING ""
| #define PACKAGE_BUGREPORT ""
| #define PACKAGE "kbirthday"
| #define VERSION "0.7.3"
| #ifdef __cplusplus
| extern "C" void std::exit (int) throw (); using std::exit;
| #endif
| #define HAVE_TEMPLATE_REPOSITORY 1
| #define KDELIBSUFF "\"64\""
| #define STDC_HEADERS 1
| #define HAVE_SYS_TYPES_H 1
| #define HAVE_SYS_STAT_H 1
| #define HAVE_STDLIB_H 1
| #define HAVE_STRING_H 1
| #define HAVE_MEMORY_H 1
| #define HAVE_STRINGS_H 1
| #define HAVE_INTTYPES_H 1
| #define HAVE_STDINT_H 1
| #define HAVE_UNISTD_H 1
| #define HAVE_DLFCN_H 1
| #define HAVE_CRYPT 1
| #define ksize_t socklen_t
| #define HAVE_SYS_TYPES_H 1
| #define HAVE_STDINT_H 1
| #define HAVE_RES_INIT 1
| #define HAVE_RES_INIT_PROTO 1
| #define SIZEOF_INT 4
| #define SIZEOF_LONG 4
| #define SIZEOF_CHAR_P 4
| #define SIZEOF_CHAR 1
| #define HAVE_VSNPRINTF 1
| #define HAVE_SNPRINTF 1
| #define HAVE_LIBZ 1
| #define HAVE_LIBPNG 1
| /* end confdefs.h. */
| /* Override any gcc2 internal prototype to avoid an error. */
| struct jpeg_decompress_struct;
| typedef struct jpeg_decompress_struct * j_decompress_ptr;
| typedef int size_t;
| #ifdef __cplusplus
| extern "C" {
| #endif
| void jpeg_CreateDecompress(j_decompress_ptr cinfo,
| int version, size_t structsize);
| #ifdef __cplusplus
| }
| #endif
| /* We use char because int might match the return type of a gcc2
| builtin and then its argument prototype would still apply. */
|
| int
| main ()
| {
| jpeg_CreateDecompress(0L, 0, 0);
| ;
| return 0;
| }
configure:22969: result: no
configure:22972: checking for libjpeg
configure:23018: gcc -o conftest -ansi -W -Wall -pedantic -Wshadow -Wpointer-arith -Wmissing-prototypes -Wwrite-strings -D_XOPEN_SOURCE=500 -D_BSD_SOURCE -O2 -I. -D_REENTRANT conftest.c -L/usr/lib64 -ljpeg -lm >&5
/usr/bin/ld: skipping incompatible /usr/lib64/libm.so when searching for -lm
/usr/bin/ld: skipping incompatible /usr/lib64/libm.a when searching for -lm
/usr/bin/ld: skipping incompatible /usr/lib64/libc.so when searching for -lc
/usr/bin/ld: skipping incompatible /usr/lib64/libc.a when searching for -lc
configure:23024: $? = 0
configure:23028: test -z
|| test ! -s conftest.err
configure:23031: $? = 0
configure:23034: test -s conftest
configure:23037: $? = 0
configure:23056: result: -ljpeg
configure: 23080: ${prefix}/include/jpeglib.h
configure: 23080: /usr/include/jpeglib.h
taking that
configure:23253: checking for Qt
configure: 23318: /usr/lib/qt3/include/qstyle.h
configure: 23318: /usr/lib/qt3/qstyle.h
configure: 23318: /usr/lib/qt/include/qstyle.h
configure: 23318: /usr/lib/qt/qstyle.h
configure: 23318: /usr/local/qt/include/qstyle.h
configure: 23318: /usr/include/qt/qstyle.h
configure: 23318: /usr/include/qstyle.h
configure: 23318: /usr/X11R6/include/X11/qt/qstyle.h
configure: 23318: /usr/X11R6/include/qt/qstyle.h
configure: 23318: /usr/X11R6/include/qt2/qstyle.h
configure: 23318: ./qstyle.h
tried NO
tried /usr/lib/qt3/lib64
tried /usr/lib/qt3
tried /usr/lib/qt/lib64
tried /usr/lib/qt
tried /usr/X11R6/lib
configure:23430: rm -rf SunWS_cache; g++ -o conftest -Wnon-virtual-dtor -Wno-long-long -Wundef -Wall -pedantic -W -Wpointer-arith -Wmissing-prototypes -Wwrite-strings -ansi -D_XOPEN_SOURCE=500 -D_BSD_SOURCE -Wcast-align -Wconversion -O2 -fno-exceptions -fno-check-new -INO -I. -DQT_THREAD_SUPPORT -D_REENTRANT -L/usr/lib -L/usr/lib64 conftest.cc -lqt-mt -lpng -lz -lm -ljpeg -ldl -lXext -lX11 -lSM -lICE -lpthread 1>&5
cc1plus: warning: command line option "-Wmissing-prototypes" is valid for Ada/C/ObjC/Pascal but not for C++
conftest.cc:2:21: error: qglobal.h: No such file or directory
conftest.cc:3:26: error: qapplication.h: No such file or directory
conftest.cc:4:21: error: qcursor.h: No such file or directory
conftest.cc:5:27: error: qstylefactory.h: No such file or directory
conftest.cc:6:34: error: private/qucomextra_p.h: No such file or directory
conftest.cc:7:8: warning: "QT_VERSION" is not defined
conftest.cc:8:2: error: #error 1
conftest.cc: In function 'int main()':
conftest.cc:12: error: 'QStyleFactory' was not declared in this scope
conftest.cc:12: error: expected `;' before '::' token
conftest.cc:13: error: 'QCursor' was not declared i

Report

fprog26

16 years ago

Nice feature!

Report

16 years ago

Kkbirthday now reads icon name from desktop file to make it changeable. Two png icons (16x16 and 32x32) were added.

12345678910
Be the first to comment
File (click to download) Version Description PackagetypeArchitectureRelease Channel Downloads Date Filesize DL OCS-Install MD5SUM
*Needs pling-store or ocs-url to install things
Pling
0 Affiliates
Details
license
version
0.7.3
updated Oct 31 2004
added Jan 06 2004
downloads 24h
0
mediaviews 24h 0
pageviews 24h 0
System Tags app software