PhotoKit

Graphic Apps by wangbin 11 comments

g++ -c -pipe -O2 -Wall -W -D_REENTRANT -fPIC -DQ_DLL_LIBRARY -DQT_NO_DEBUG -DQT_GUI_LIB -DQT_CORE_LIB -DQT_SHARED -I/usr/share/qt4/mkspecs/linux-g++ -I. -I/usr/include/qt4/QtCore -I/usr/include/qt4/QtGui -I/usr/include/qt4 -I. -I/usr/src/RPM/BUILD/PhotoKit/src/NextEffect/src/loki/include -I../out/.moc/4.8.4 -o ../out/.obj/libNextEffect_linux/singleton.o singleton.cpp
In file included from singleton.cpp:20:0:
singleton.h: In static member function 'static void Singleton<T>::MakeInstance()':
singleton.h:76:13: error: 'cerr' is not a member of 'std'
singleton.h:76:55: error: 'endl' is not a member of 'std'
make[1]: *** [../out/.obj/libNextEffect_linux/singleton.o] Error 1
make[1]: Leaving directory `/usr/src/RPM/BUILD/PhotoKit/src/NextEffect/src'
make: *** [sub-src-NextEffect-src-libNextEffect-pro-make_default] Error 2
- Dec 29 2012
PhotoKit

Graphic Apps by wangbin 11 comments

g++ -c -pipe -std=c++0x -U__STRICT_ANSI__ -O2 -Wall -W -D_REENTRANT -fPIC -DQ_DLL_LIBRARY -DQT_NO_DEBUG -DQT_GUI_LIB -DQT_CORE_LIB -DQT_SHARED -I/usr/share/qt4/mkspecs/linux-g++ -I. -I/usr/include/qt4/QtCore -I/usr/include/qt4/QtGui -I/usr/include/qt4 -I. -I/usr/src/RPM/BUILD/PhotoKit/src/NextEffect/src/loki/include -I../out/.moc/4.8.4 -o ../out/.obj/libNextEffect_linux/nexteffect_none.o nexteffect_none.cpp
In file included from /usr/lib/gcc/i586-alt-linux/4.5.3/../../../../include/c++/4.5.3/functional:54:0,
from nexteffectfactory.h:87,
from nexteffect_none.cpp:21:
/usr/lib/gcc/i586-alt-linux/4.5.3/../../../../include/c++/4.5.3/typeinfo:40:8: error: expected unqualified-id before string constant
/usr/lib/gcc/i586-alt-linux/4.5.3/../../../../include/c++/4.5.3/typeinfo:205:27: error: expected '}' before end of line
/usr/lib/gcc/i586-alt-linux/4.5.3/../../../../include/c++/4.5.3/typeinfo:205:27: error: expected unqualified-id before end of line
/usr/lib/gcc/i586-alt-linux/4.5.3/../../../../include/c++/4.5.3/typeinfo:205:27: error: expected declaration before end of line
make[1]: *** [../out/.obj/libNextEffect_linux/nexteffect_none.o] Error 1
make[1]: Leaving directory `/usr/src/RPM/BUILD/PhotoKit/src/NextEffect/src'
make: *** [sub-src-NextEffect-src-libNextEffect-pro-make_default] Error 2



rpm -qa | grep libqt4
libqt4-core-4.8.4-alt0.M60P.1
libqt4-sql-sqlite-4.8.4-alt0.M60P.1
libqt4-script-4.8.4-alt0.M60P.1
libqt4-gui-4.8.4-alt0.M60P.1
libqt4-svg-4.8.4-alt0.M60P.1
libqt4-help-4.8.4-alt0.M60P.1
libqt4-4.8.4-alt0.M60P.1
libqt4-devel-4.8.4-alt0.M60P.1
libqt4-sql-4.8.4-alt0.M60P.1
libqt4-xml-4.8.4-alt0.M60P.1
libqt4-network-4.8.4-alt0.M60P.1
libqt4-xmlpatterns-4.8.4-alt0.M60P.1
libqt4-test-4.8.4-alt0.M60P.1
libqt4-qt3support-4.8.4-alt0.M60P.1
libqt4-designer-4.8.4-alt0.M60P.1
libqt4-multimedia-4.8.4-alt0.M60P.1
libqt4-opengl-4.8.4-alt0.M60P.1
libqt4-declarative-4.8.4-alt0.M60P.1
libqt4-scripttools-4.8.4-alt0.M60P.1
libqt4-dbus-4.8.4-alt0.M60P.1
libqt4-clucene-4.8.4-alt0.M60P.1
libqt4-uitools-4.8.4-alt0.M60P.1
libqt4-webkit-4.8.4-alt0.M60P.1
- Dec 27 2012
PhotoKit

Graphic Apps by wangbin 11 comments

After "git clone git://github.com/wang-bin/PhotoKit.git":
===================================================
qmake-qt4
[builder@localhost PhotoKit]$ make
cd src/ezlog/src/ && /usr/bin/qmake-qt4 /usr/src/RPM/BUILD/PhotoKit/src/ezlog/src/libezlog.pro -o Makefile.libezlog
Cannot find file: /usr/src/RPM/BUILD/PhotoKit/src/ezlog/src/libezlog.pro.
make: *** [src/ezlog/src/Makefile.libezlog] Error 2
===================================================
ls -l /usr/src/RPM/BUILD/PhotoKit/src/ezlog/src/
total 0
- Sep 04 2012
qMetro

Utilities by NoIdea 21 comments

С иерархиев все совершенно правильно при системной установке из пакета/etc. А вот если пользователь хочет подкинуть карт, но не имеет прав админа - я бы сделал по аналогии, как в Qmmp сделан поиск скинов - сначала программа ищет их в /usr/share/qmmp/skins, а затем смотрит в ~/.qmmp/skins и пользователь видит все найденные скины. Было бы неплохо сделать примерно так же. - Aug 11 2012
qMetro

Utilities by NoIdea 21 comments

Очень некрасиво сделано - качать карты руками и класть их в каталог, доступный только руту. Если скачивание карт вручную еще куда ни шло, то запихивание их в /usr/share/qmetro/map никуда не годится. Нужно сделать в настройках выбор каталога с картами, чтоб можно было складывать их в место, доступное текущему юзеру, и оттуда их использовать.

P.S. А возможно ли реализовать автоматическое скачивание нужных карт средствами самой программы? - Aug 09 2012
Syncloud

Network by cyberb 14 comments

Without the source code - it is not GPL - Jul 10 2012
On rpm-based distro it can not be done automatically with the deb-package without tarball.

You will be surprised, but Linux is not Ubuntu... - Jul 09 2012
Where's the source code? - Jul 09 2012
Feff

Video Apps by admsasha 75 comments

avconv is a fork ffmpeg from libav:
http://libav.org/ - Jun 17 2012
Feff

Video Apps by admsasha 75 comments

Do you plan to support avconv optionally? - Jun 15 2012
Silicon

Utilities by brdn25 11 comments

And:

rpm -ql silicon | grep lib
/usr/lib/libSDataBase.so
/usr/lib/libSiDi.so
/usr/lib/libSiliconLib.so
/usr/lib/silicon
/usr/lib/silicon/apps
/usr/lib/silicon/apps/libAudioDisc.so
/usr/lib/silicon/apps/libConverter.so
/usr/lib/silicon/apps/libCopyDisc.so
/usr/lib/silicon/apps/libDataBase.so
/usr/lib/silicon/apps/libDataDisc.so
/usr/lib/silicon/apps/libDiscDetails.so
/usr/lib/silicon/apps/libDiscEraser.so
/usr/lib/silicon/apps/libDiscImaging.so
/usr/lib/silicon/apps/libDiscScanner.so
/usr/lib/silicon/apps/libImageBurner.so
/usr/lib/silicon/apps/libLibrary.so
/usr/lib/silicon/apps/libMounter.so
/usr/lib/silicon/apps/libPhoto-Viewer.so
/usr/lib/silicon/apps/libSampleApp.so
/usr/lib/silicon/apps/libScriptRunner.so
/usr/lib/silicon/apps/libTagargPlayer.so
/usr/lib/silicon/plugins
/usr/lib/silicon/plugins/libFUseIso.so
/usr/lib/silicon/plugins/libHalDeviceNotifier.so
/usr/lib/silicon/plugins/libHalUDisk.so
/usr/lib/silicon/plugins/libLyricBrowser.so
/usr/lib/silicon/plugins/libMkIsoFs.so
/usr/lib/silicon/plugins/libNowPlaying.so
/usr/lib/silicon/plugins/libSingleInnerDialog.so
/usr/lib/silicon/plugins/libSystemTray.so
/usr/lib/silicon/plugins/libUDisks.so
/usr/lib/silicon/plugins/libmpg123.so
/usr/lib/silicon/plugins/libmpg321.so
- Mar 26 2012
Silicon

Utilities by brdn25 11 comments

All available plugins: http://2.firepic.org/2/images/2012-03/26/8nzomq0x01ez.png - Mar 26 2012
Silicon

Utilities by brdn25 11 comments

There are no errors, in the terminal too there are no errors, disk write process always 0%, the indicator of activity of CD/DVD isn't shone. Tried on behalf of root - no any difference. - Mar 26 2012
Silicon

Utilities by brdn25 11 comments

Not burned on ALT Linux :(
nosrc.rpm for ALT Linux: http://zalil.ru/32948519 - Mar 25 2012
Silicon

Utilities by brdn25 11 comments

Verifying and fixing files in /usr/src/tmp/silicon-buildroot (binconfig,pkgconfig,libtool)
Compressing files in /usr/src/tmp/silicon-buildroot (auto)
Adjusting library links in /usr/src/tmp/silicon-buildroot
./usr/lib:
libSiDi.so -> libSiDi.so
libSDataBase.so -> libSDataBase.so
libSiliconLib.so -> libSiliconLib.so
Verifying ELF objects in /usr/src/tmp/silicon-buildroot (arch=normal,fhs=normal,lint=relaxed,rpath=normal,stack=normal,textrel=normal,unresolved=normal)
verify-elf: ERROR: ./usr/lib/libSiDi.so: undefined symbol: _ZN7Silicon15requestTempFileEv
verify-elf: ERROR: ./usr/lib/libSiDi.so: undefined symbol: _ZN7SDialogC1Eii
error: Bad exit status from /usr/src/tmp/rpm-tmp.77452 (%install)


RPM build errors:
Bad exit status from /usr/src/tmp/rpm-tmp.77452 (%install)
- Mar 25 2012
Silicon

Utilities by brdn25 11 comments

Verifying and fixing files in /usr/src/tmp/silicon-buildroot (binconfig,pkgconfig,libtool)
Compressing files in /usr/src/tmp/silicon-buildroot (auto)
Adjusting library links in /usr/src/tmp/silicon-buildroot
./usr/lib:
libSiDi.so -> libSiDi.so
libSDataBase.so -> libSDataBase.so
libSiliconLib.so -> libSiliconLib.so
Verifying ELF objects in /usr/src/tmp/silicon-buildroot (arch=normal,fhs=normal,lint=relaxed,rpath=normal,stack=normal,textrel=normal,unresolved=normal)
verify-elf: ERROR: ./usr/lib/libSiDi.so: undefined symbol: _ZN7Silicon15requestTempFileEv
verify-elf: ERROR: ./usr/lib/libSiDi.so: undefined symbol: _ZN7SDialogC1Eii
error: Bad exit status from /usr/src/tmp/rpm-tmp.77452 (%install)


RPM build errors:
Bad exit status from /usr/src/tmp/rpm-tmp.77452 (%install)
- Mar 25 2012
qtfm

System Software by Wittfella 20 comments

Yes. With this patch all Ok:
http://git.altlinux.org/people/drool/packages/?p=qtfm.git;a=blob_plain;f=qtfm-5.3-old_qt.diff;hb=HEAD
Now QtFM pushed to ALT Linux (unstable Sisyphus and branches t6 ant 5.1). Thank you!
http://sisyphus.ru/en/srpm/Sisyphus/qtfm
http://git.altlinux.org/people/drool/packages/?p=qtfm.git

P.S. ssh git.alt task ls
Enter passphrase for key '/home/drool/.ssh/id_dsa':
#60579 AWAITING #1 5.1 qtfm.git=5.3-alt0.M51.1
#60578 AWAITING #1 t6 qtfm.git=5.3-alt0.M60T.1
#60577 BUILDING #1 [locked] sisyphus qtfm.git=5.3-alt1 - Dec 18 2011
qtfm

System Software by Wittfella 20 comments

=======================================
g++ -c -pipe -pipe -Wall -O2 -march=athlon -mtune=athlon-xp -D_REENTRANT -w -DQT_NO_DEBUG -DQT_GUI_LIB -DQT_NETWORK_LIB -DQT_CORE_LIB -DQT_SHARED -I../../../../share/qt4/mkspecs/linux-g++ -I. -I../../../../include/qt4/QtCore -I../../../../include/qt4/QtNetwork -I../../../../include/qt4/QtGui -I../../../../include/qt4 -I. -Isrc -Ibuild -o build/mainwindow.o src/mainwindow.cpp
In file included from src/mainwindow.cpp:29:
src/actions.cpp: In member function 'void MainWindow::addressChanged(int, int)':
src/actions.cpp:605: error: 'MiddleButton' is not a member of 'Qt'
make: *** [build/mainwindow.o] Error 1
=======================================
With 5.2 version - all Ok.

rpm -q libqt4
libqt4-4.6.3-alt1.M51.1
- Dec 16 2011
Lightweight2

Browser by Blahord 121 comments

> You can still allow Flash for specific pages.

The program crashes on any site that uses flash . - Jun 03 2011
Lightweight2

Browser by Blahord 121 comments

Strace log^ http://zalil.ru/31187770 - Jun 03 2011
Lightweight2

Browser by Blahord 121 comments

Version - from this link
Qt4 - 4.6.3
OS - ALT Linux 5.1
Adobe flash - 10.2.159.1 - Jun 03 2011
Lightweight2

Browser by Blahord 121 comments

p78.ru - crash
uaget.homeip.net - crash
youtube.com - crash

It is impossible to use - Jun 02 2011
scOpe

System Software by fr33mind 28 comments

This is in no hurry. At home I have a newer system, where the program compiles without problems. - May 31 2011
scOpe

System Software by fr33mind 28 comments

g++ -I. -I../../../../include/qt4/QtCore -I../../../../include/qt4/QtCore -I../../../../include/qt4/QtGui -I../../../../include/qt4/QtGui -I../../../../include/qt4/QtDBus -I../../../../include/qt4/QtDBus -I../../../../include/qt4 -I. -Isource -Isource/dialogs -Isource/adaptors -Isource/right_panel -Ibuild -Ibuild -o build/lineedit.o source/lineedit.cpp
source/lineedit.cpp: In member function 'void LineEdit::updateTextMargins()':
source/lineedit.cpp:170: error: 'setTextMargins' was not declared in this scope
make: *** [build/lineedit.o] Error 1
- May 30 2011
Patriott

Browser by wambagilles 21 comments

> Also which distro are you using, so that i can add compatibility for it.

P.S. Not necessarily do it . Proprietary software I'm not interested , especially since there are similar browsers that are open source . - May 27 2011
Patriott

Browser by wambagilles 21 comments

Fisrt error - ALT Linux 4.1.
Latest stable ALT Linux 5.1:
==================================
./Patriott_1.0.0_Ubuntu_32bit
cookie error
value read true
QObject::connect: Incompatible sender/receiver arguments
WebView::loadProgress(int) --> Page::refreshUrlAndIcon(QUrl)
tab changed
QObject::connect: Incompatible sender/receiver arguments
WebView::loadStarted() --> Tabulations::tabIconLoading(int)
./Patriott_1.0.0_Ubuntu_32bit: symbol lookup error: ./Patriott_1.0.0_Ubuntu_32bit: undefined symbol: _ZN9QListData11detach_growEPii
================================== - May 27 2011
scOpe

System Software by fr33mind 28 comments

=========================================
g++ -c -pipe -Wall -W -D_REENTRANT -DQT_NO_DEBUG -DQT_DBUS_LIB -DQT_GUI_LIB -DQT_CORE_LIB -I../../../../share/qt4/mkspecs/linux-g++ -I. -I../../../../include/qt4/QtCore -I../../../../include/qt4/QtCore -I../../../../include/qt4/QtGui -I../../../../include/qt4/QtGui -I../../../../include/qt4/QtDBus -I../../../../include/qt4/QtDBus -I../../../../include/qt4 -I. -Isource -Isource/dialogs -Isource/adaptors -Isource/right_panel -I. -I. -o scope.o source/scope.cpp
./ui_scope.h:197: warning: unused parameter 'ScopeWindow'
source/scope.cpp: In member function 'bool Scope::setDir(const QString&)':
source/scope.cpp:131: error: 'class QList<QAction*>' has no member named 'length'
source/scope.cpp: At global scope:
source/scope.cpp:398: warning: unused parameter 'deselected'
source/scope.cpp: In member function 'void Scope::goBack(QAction*)':
source/scope.cpp:449: error: 'class QList<QAction*>' has no member named 'length'
source/scope.cpp:463: error: 'class QList<QAction*>' has no member named 'length'
source/scope.cpp:467: error: 'class QList<QAction*>' has no member named 'length'
source/scope.cpp: In member function 'void Scope::goForward(QAction*)':
source/scope.cpp:502: error: 'class QList<QAction*>' has no member named 'length'
source/scope.cpp:516: error: 'class QList<QAction*>' has no member named 'length'
source/scope.cpp:520: error: 'class QList<QAction*>' has no member named 'length'
make: *** [scope.o] Error 1
=======================================
rpm -q libqt4
libqt4-4.4.3-alt1.M41.1

:( - May 27 2011
Patriott

Browser by wambagilles 21 comments

./Patriott_1.0.0_Ubuntu_32bit
cookie error
./Patriott_1.0.0_Ubuntu_32bit: symbol lookup error: ./Patriott_1.0.0_Ubuntu_32bit: undefined symbol: _ZN12QWebSettings21setOfflineStoragePathERK7QString
- May 27 2011
WebRender

Browser by anandbose99k 16 comments

==========================================
g++ -c -pipe -Wall -W -D_REENTRANT -DQT_NO_DEBUG -DQT_WEBKIT_LIB -DQT_GUI_LIB -DQT_NETWORK_LIB -DQT_CORE_LIB -DQT_SHARED -I../../../../share/qt4/mkspecs/linux-g++ -I. -I../../../../include/qt4/QtCore -I../../../../include/qt4/QtNetwork -I../../../../include/qt4/QtGui -I../../../../include/qt4/QtWebKit -I../../../../include/qt4 -I. -I. -o preferences.o preferences.cpp
preferences.cpp: In member function 'void Preferences::getSettings(QWebPage*)':
preferences.cpp:38: error: 'SpatialNavigationEnabled' is not a member of 'QWebSettings'
preferences.cpp:40: error: 'LocalContentCanAccessFileUrls' is not a member of 'QWebSettings'
preferences.cpp:41: error: 'XSSAuditingEnabled' is not a member of 'QWebSettings'
preferences.cpp:42: error: 'AcceleratedCompositingEnabled' is not a member of 'QWebSettings'
preferences.cpp:43: error: 'SiteSpecificQuirksEnabled' is not a member of 'QWebSettings'
preferences.cpp: In member function 'bool Preferences::set(QWebPage*)':
preferences.cpp:129: error: 'SpatialNavigationEnabled' is not a member of 'QWebSettings'
preferences.cpp:131: error: 'LocalContentCanAccessFileUrls' is not a member of 'QWebSettings'
preferences.cpp:132: error: 'XSSAuditingEnabled' is not a member of 'QWebSettings'
preferences.cpp:133: error: 'AcceleratedCompositingEnabled' is not a member of 'QWebSettings'
preferences.cpp:134: error: 'SiteSpecificQuirksEnabled' is not a member of 'QWebSettings'
make: *** [preferences.o] Error 1
=======================================
rpm -q libqt4
libqt4-4.6.3-alt1.M51.1

rpm -qa | grep webkit
libqt4-webkit-4.6.3-alt1.M51.1
libwebkit-1.2.6-alt1.M51.1
libwebkit-devel-1.2.6-alt1.M51.1
- May 27 2011
Patriott

Browser by wambagilles 21 comments

Proprietary and only Ubuntu? Without sources? Must die! - May 27 2011
HeyTrack

Audio Apps by mosra 2 comments

You are can make a support player Qmmp?
http://qmmp.ylsoftware.com/index_en.php - Nov 12 2010
Qt Media Player

Audioplayers by matthiasFauconneau 8 comments

make: Entering directory `/usr/src/RPM/BUILD/qt-media-player'
g++ -c -pipe -pipe -Wall -O2 -march=athlon -mtune=athlon-xp -Wall -W -D_REENTRANT -DUSE_DIALOG -DUSE_VIDEO -DUSE_HOTKEY -DQT_NO_DEBUG -DQT_OPENGL_LIB -DQT_GUI_LIB -DQT_CORE_LIB -DQT_SHARED -I../../../../share/qt4/mkspecs/linux-g++ -I. -I../../../../include/qt4/QtCore -I../../../../include/qt4/QtGui -I../../../../include/qt4/QtOpenGL -I../../../../include/qt4 -I../../../../X11R6/include -Ibuild -o build/main.o main.cpp
g++ -c -pipe -pipe -Wall -O2 -march=athlon -mtune=athlon-xp -Wall -W -D_REENTRANT -DUSE_DIALOG -DUSE_VIDEO -DUSE_HOTKEY -DQT_NO_DEBUG -DQT_OPENGL_LIB -DQT_GUI_LIB -DQT_CORE_LIB -DQT_SHARED -I../../../../share/qt4/mkspecs/linux-g++ -I. -I../../../../include/qt4/QtCore -I../../../../include/qt4/QtGui -I../../../../include/qt4/QtOpenGL -I../../../../include/qt4 -I../../../../X11R6/include -Ibuild -o build/avfile.o avfile.cpp
avfile.cpp: In member function 'void AVFile::open(QString)':
avfile.cpp:68: error: 'CH_LAYOUT_NATIVE' was not declared in this scope
make: *** [build/avfile.o] Error 1
make: *** Waiting for unfinished jobs....
make: Leaving directory `/usr/src/RPM/BUILD/qt-media-player'
error: Bad exit status from /usr/src/tmp/rpm-tmp.42010 (%build)


rpm -qa | grep avcodec
libavcodec-devel-0.5-alt1.svn19530.1.drool
libavcodec52-0.5-alt1.svn19530.1.drool
- Sep 04 2010
Qt Media Player

Audioplayers by matthiasFauconneau 8 comments

Thx! New trouble:

make
g++ -c -pipe -Wall -W -D_REENTRANT -DUSE_DIALOG -DUSE_VIDEO -DUSE_TAGLIB -DUSE_HOTKEY -DQT_NO_DEBUG -DQT_OPENGL_LIB -DQT_GUI_LIB -DQT_CORE_LIB -DQT_SHARED -I../../../../share/qt4/mkspecs/linux-g++ -I. -I../../../../include/qt4/QtCore -I../../../../include/qt4/QtGui -I../../../../include/qt4/QtOpenGL -I../../../../include/qt4 -I../../../../X11R6/include -Ibuild -o build/main.o main.cpp
In file included from main.h:20,
from main.cpp:2:
media.h:4: error: conflicting declaration 'typedef long int int64_t'
/usr/include/sys/types.h:198: error: 'int64_t' has a previous declaration as 'typedef long long int int64_t'
make: *** [build/main.o] Error 1
- Aug 26 2010
Qt Media Player

Audioplayers by matthiasFauconneau 8 comments

g++ -c -pipe -Wall -W -D_REENTRANT -DUSE_KDE -DUSE_VIDEO -DUSE_TAGLIB -DUSE_HOTKEY -DQT_NO_DEBUG -DQT_OPENGL_LIB -DQT_GUI_LIB -DQT_CORE_LIB -DQT_SHARED -I../../../../share/qt4/mkspecs/linux-g++ -I. -I../../../../include/qt4/QtCore -I../../../../include/qt4/QtGui -I../../../../include/qt4/QtOpenGL -I../../../../include/qt4 -I../../../../X11R6/include -Ibuild -o build/main.o main.cpp
In file included from main.cpp:1:
main.h:24:27: error: KDE/KFileDialog: No such file or directory
In file included from main.h:19,
from main.cpp:1:
media.h:4: error: conflicting declaration 'typedef long int int64_t'
/usr/include/sys/types.h:198: error: 'int64_t' has a previous declaration as 'typedef long long int int64_t'
In file included from main.cpp:1:
main.h:89: error: ISO C++ forbids declaration of 'KFileDialog' with no type
main.h:89: error: expected ';' before '*' token
main.cpp: In constructor 'Player::Player()':
main.cpp:105: error: 'dialog' was not declared in this scope
main.cpp:105: error: expected type-specifier before 'KFileDialog'
main.cpp:105: error: expected ';' before 'KFileDialog'
main.cpp:106: error: 'KFile' has not been declared
main.cpp:106: error: 'KFile' has not been declared
main.cpp: In member function 'void Player::toggleOpen(bool)':
main.cpp:137: error: 'dialog' was not declared in this scope
main.cpp:137: error: 'dialog' was not declared in this scope
main.cpp: In member function 'void Player::open()':
main.cpp:142: error: 'dialog' was not declared in this scope
main.cpp:142: error: template argument 1 is invalid
main.cpp:142: error: invalid type in declaration before '(' token
main.cpp:142: error: request for member 'brk' in '_container_', which is of non-class type 'int'
main.cpp:142: error: request for member 'i' in '_container_', which is of non-class type 'int'
main.cpp:142: error: request for member 'e' in '_container_', which is of non-class type 'int'
main.cpp:142: error: request for member 'brk' in '_container_', which is of non-class type 'int'
main.cpp:142: error: request for member 'i' in '_container_', which is of non-class type 'int'
main.cpp:142: error: 'KUrl' was not declared in this scope
main.cpp:142: error: expected ';' before 'url'
main.cpp:142: error: request for member 'brk' in '_container_', which is of non-class type 'int'
main.cpp:142: error: 'url' was not declared in this scope
make: *** [build/main.o] Error 1
- Aug 18 2010
QGoogleTranslate

Education Apps by lexnewton 5 comments

Latest svn revision build for ALT Linux Sisyphus and 5.1, use
apt-get install qgoogletranslate
for install from official repositories - Aug 12 2010
ScreenGrab

Screenshot Tools by DOOMer 26 comments

ScreenGrab compiled and sent to ALT Linux branch 5.1! - May 23 2010
ScreenGrab

Screenshot Tools by DOOMer 26 comments

Ссылки нужно обновить на 0.8.1 версию, либо просто сделать постоянной ссылку такой:
http://sisyphus.ru/en/srpm/Sisyphus/screengrab - May 16 2010
Wally

Utilities by becrux 57 comments

Cannot build for ALT Linux Sisyphus:
==================================
[ 90%] Building CXX object CMakeFiles/wally.dir/include/moc_smugmug.cxx.o
[ 91%] Building CXX object CMakeFiles/wally.dir/include/moc_bing.cxx.o
[ 93%] Building CXX object CMakeFiles/wally.dir/include/moc_splash.cxx.o
[ 94%] Building CXX object CMakeFiles/wally.dir/include/moc_settings.cxx.o
[ 95%] Building CXX object CMakeFiles/wally.dir/include/moc_history.cxx.o
[ 96%] Building CXX object CMakeFiles/wally.dir/include/moc_viewer.cxx.o
[ 97%] Building CXX object CMakeFiles/wally.dir/include/moc_about.cxx.o
[ 98%] Building CXX object CMakeFiles/wally.dir/include/moc_wally.cxx.o
[100%] Building CXX object CMakeFiles/wally.dir/qrc_wally.cxx.o
Linking CXX executable wally
CMakeFiles/wally.dir/src/main.cpp.o: In function `global constructors keyed
to main':
main.cpp:(.text+0x1f2): undefined reference to `qt_plugin_instance_qgif()'
main.cpp:(.text+0x205): undefined reference to `qt_plugin_instance_qico()'
main.cpp:(.text+0x20f): undefined reference to `qt_plugin_instance_qjpeg()'
main.cpp:(.text+0x219): undefined reference to `qt_plugin_instance_qmng()'
main.cpp:(.text+0x223): undefined reference to `qt_plugin_instance_qsvg()'
main.cpp:(.text+0x22d): undefined reference to `qt_plugin_instance_qtiff()'
main.cpp:(.text+0x237): undefined reference to
`qt_plugin_instance_qsqlite()'
collect2: ld returned 1 exit status
make[2]: *** [wally] Error 1
make[2]: Leaving directory `/usr/src/RPM/BUILD/wally-2.3.2'
make[1]: *** [CMakeFiles/wally.dir/all] Error 2
make[1]: Leaving directory `/usr/src/RPM/BUILD/wally-2.3.2'
make: *** [all] Error 2
make: Leaving directory `/usr/src/RPM/BUILD/wally-2.3.2'
error: Bad exit status from /usr/src/tmp/rpm-tmp.87889 (%build)
==================================
rpm -q libqt4-devel
libqt4-devel-4.6.2-alt2

rpm -qa | grep gcc
libgcc4.4-4.4.3-alt2
gcc4.4-c++-4.4.3-alt2
gcc4.4-4.4.3-alt2
gccmakedep-1.0.1-alt1
gcc-common-1.4.14-alt1
gcc-c++-common-1.4.14-alt1

rpm -q cmake
cmake-2.8.1-alt2 - May 10 2010
ScreenGrab

Screenshot Tools by DOOMer 26 comments

Ссылки те же ;) - Mar 30 2010
ASTranslator

Education Apps by AlexBSnet 22 comments

g++ -c -pipe -pipe -Wall -O2 -march=i586 -mtune=i686 -Wall -W -D_REENTRANT -DQT_NO_DEBUG -DQT_SCRIPT_LIB -DQT_GUI_LIB -DQT_NETWORK_LIB -DQT_CORE_LIB -I/usr/share/qt4/mkspecs/linux-g++ -I. -I/usr/include/qt4/QtCore -I/usr/include/qt4/QtCore -I/usr/include/qt4/QtNetwork -I/usr/include/qt4/QtNetwork -I/usr/include/qt4/QtGui -I/usr/include/qt4/QtGui -I/usr/include/qt4/QtScript -I/usr/include/qt4/QtScript -I/usr/include/qt4 -Itemp -Itemp -o temp/googleproto.o src/googleproto.cpp
src/googleproto.cpp: In member function 'void GoogleProto::textTranslated()':
src/googleproto.cpp:61: error: no matching function for call to 'QString::compare(QStringRef)'
/usr/include/qt4/QtCore/qstring.h:317: note: candidates are: int QString::compare(const QString&) const
/usr/include/qt4/QtCore/qstring.h:318: note: int QString::compare(const QString&, Qt::CaseSensitivity) const
/usr/include/qt4/QtCore/qstring.h:320: note: int QString::compare(const QLatin1String&, Qt::CaseSensitivity) const
/usr/include/qt4/QtCore/qstring.h:323: note: static int QString::compare(const QString&, const QString&)
/usr/include/qt4/QtCore/qstring.h:325: note: static int QString::compare(const QString&, const QString&, Qt::CaseSensitivity)
/usr/include/qt4/QtCore/qstring.h:329: note: static int QString::compare(const QString&, const QLatin1String&, Qt::CaseSensitivity)
/usr/include/qt4/QtCore/qstring.h:332: note: static int QString::compare(const QLatin1String&, const QString&, Qt::CaseSensitivity)
make: *** [temp/googleproto.o] Error 1 - Mar 30 2010
ScreenGrab

Screenshot Tools by DOOMer 26 comments

rpm and srpm:
http://www.sisyphus.ru/en/srpm/Sisyphus/screengrab

git:
http://git.altlinux.org/people/drool/packages/?p=screengrab.git - Mar 27 2010
QGMailNotifier

Email by proxy 10 comments

For ALT Linux 4.1, 5,1 and Sisyphus:
http://sisyphus.ru/en/srpm/Sisyphus/qgmailnotifier - Jan 11 2010
Battleship

Shoot em up by Taiko 7 comments

All Ok :) - Jan 06 2010
ipQalc

Network by admsasha 2 comments

Нужно сделать еще хотя бы английский язык в программе. Иначе ее аудитория будет ничтожной. - Jan 06 2010
Battleship

Shoot em up by Taiko 7 comments

================================
g++ -c -pipe -fPIC -Wall -W -D_REENTRANT -DQT_NO_DEBUG -DQT_NO_DEBUG -DQT_GUI_LIB -DQT_CORE_LIB -I/usr/share/qt4/mkspecs/linux-g++ -I. -I/usr/include/qt4/QtCore -I/usr/include/qt4/QtGui -I/usr/include/qt4 -I../../include -I../../Build/QPropertyEditor/Release -o ../../Build/QPropertyEditor/Release/Property.o Property.cpp
Property.cpp: In member function 'virtual QWidget* Property::createEditor(QWidget*, const QStyleOptionViewItem&)':
Property.cpp:69: error: 'INT_MAX' was not declared in this scope
make[4]: *** [../../Build/QPropertyEditor/Release/Property.o] Error 1
make[4]: Leaving directory `/usr/src/RPM/BUILD/battleship/QPropertyEditor_0.3/src/QPropertyEditor'
make[3]: *** [release] Error 2
make[3]: Leaving directory `/usr/src/RPM/BUILD/battleship/QPropertyEditor_0.3/src/QPropertyEditor'
make[2]: *** [sub-QPropertyEditor-make_default] Error 2
make[2]: Leaving directory `/usr/src/RPM/BUILD/battleship/QPropertyEditor_0.3/src'
make[1]: *** [sub-src-make_default] Error 2
make[1]: Leaving directory `/usr/src/RPM/BUILD/battleship/QPropertyEditor_0.3'
make: *** [sub-QPropertyEditor_0-3-make_default-ordered] Error 2
================================
rpm -q libqt4
libqt4-4.5.2-alt7 - Jan 06 2010
OneClickFTP

FTP by Slowmo 20 comments

g++ -o bin/oneclickftp build/ftpwindowimpl.o build/main.o build/mainwindowimpl.o build/browseftpimpl.o build/addprofileimpl.o build/settingsimpl.o build/exportprofilesimpl.o build/def.o build/updatefilestatusimpl.o build/moc_ftpwindowimpl.o build/moc_mainwindowimpl.o build/moc_browseftpimpl.o build/moc_addprofileimpl.o build/moc_settingsimpl.o build/moc_exportprofilesimpl.o build/moc_updatefilestatusimpl.o build/qrc_oneclickftp.o -L/usr/lib -L/usr/lib -lqca -lQtGui -lQtNetwork -lQtCore -lpthread
build/main.o: In function `main':
/usr/src/RPM/BUILD/oneclickftp-0.5.0/src/main.cpp:183: undefined reference to `QCA::Initializer::Initializer(QCA::MemoryMode, int)'
/usr/src/RPM/BUILD/oneclickftp-0.5.0/src/main.cpp:184: undefined reference to `QCA::SecureArray::SecureArray(QByteArray const&)'
/usr/src/RPM/BUILD/oneclickftp-0.5.0/src/main.cpp:187: undefined reference to `QCA::SymmetricKey::SymmetricKey(QByteArray const&)'
/usr/src/RPM/BUILD/oneclickftp-0.5.0/src/main.cpp:188: undefined reference to `QCA::InitializationVector::InitializationVector(QByteArray const&)'
/usr/src/RPM/BUILD/oneclickftp-0.5.0/src/main.cpp:189: undefined reference to `QCA::Cipher::Cipher(QString const&, QCA::Cipher::Mode, QCA::Cipher::Padding, QCA::Direction, QCA::SymmetricKey const&, QCA::InitializationVector const&, QString const&)'
/usr/src/RPM/BUILD/oneclickftp-0.5.0/src/main.cpp:191: undefined reference to `QCA::Filter::process(QCA::MemoryRegion const&)'
/usr/src/RPM/BUILD/oneclickftp-0.5.0/src/main.cpp:191: undefined reference to `QCA::MemoryRegion::toByteArray() const'
/usr/src/RPM/BUILD/oneclickftp-0.5.0/src/main.cpp:191: undefined reference to `QCA::MemoryRegion::~MemoryRegion()'
/usr/src/RPM/BUILD/oneclickftp-0.5.0/src/main.cpp:191: undefined reference to `QCA::MemoryRegion::~MemoryRegion()'
/usr/src/RPM/BUILD/oneclickftp-0.5.0/src/main.cpp:199: undefined reference to `QCA::Hash::Hash(QString const&, QString const&)'
/usr/src/RPM/BUILD/oneclickftp-0.5.0/src/main.cpp:200: undefined reference to `QCA::MemoryRegion::MemoryRegion(QByteArray const&)'
/usr/src/RPM/BUILD/oneclickftp-0.5.0/src/main.cpp:200: undefined reference to `QCA::Hash::hash(QCA::MemoryRegion const&)'
/usr/src/RPM/BUILD/oneclickftp-0.5.0/src/main.cpp:200: undefined reference to `QCA::MemoryRegion::toByteArray() const'
/usr/src/RPM/BUILD/oneclickftp-0.5.0/src/main.cpp:200: undefined reference to `QCA::MemoryRegion::~MemoryRegion()'
/usr/src/RPM/BUILD/oneclickftp-0.5.0/src/main.cpp:200: undefined reference to `QCA::MemoryRegion::~MemoryRegion()'
/usr/src/RPM/BUILD/oneclickftp-0.5.0/src/main.cpp:200: undefined reference to `QCA::MemoryRegion::~MemoryRegion()'
/usr/src/RPM/BUILD/oneclickftp-0.5.0/src/main.cpp:200: undefined reference to `QCA::MemoryRegion::~MemoryRegion()'
/usr/src/RPM/BUILD/oneclickftp-0.5.0/src/main.cpp:204: undefined reference to `QCA::Hash::Hash(QString const&, QString const&)'
/usr/src/RPM/BUILD/oneclickftp-0.5.0/src/main.cpp:205: undefined reference to `QCA::MemoryRegion::MemoryRegion(QByteArray const&)'
/usr/src/RPM/BUILD/oneclickftp-0.5.0/src/main.cpp:205: undefined reference to `QCA::Hash::hash(QCA::MemoryRegion const&)'
/usr/src/RPM/BUILD/oneclickftp-0.5.0/src/main.cpp:205: undefined reference to `QCA::MemoryRegion::toByteArray() const'
/usr/src/RPM/BUILD/oneclickftp-0.5.0/src/main.cpp:205: undefined reference to `QCA::MemoryRegion::~MemoryRegion()'
/usr/src/RPM/BUILD/oneclickftp-0.5.0/src/main.cpp:205: undefined reference to `QCA::MemoryRegion::~MemoryRegion()'
/usr/src/RPM/BUILD/oneclickftp-0.5.0/src/main.cpp:205: undefined reference to `QCA::MemoryRegion::~MemoryRegion()'
/usr/src/RPM/BUILD/oneclickftp-0.5.0/src/main.cpp:205: undefined reference to `QCA::MemoryRegion::~MemoryRegion()'
/usr/src/RPM/BUILD/oneclickftp-0.5.0/src/main.cpp:210: undefined reference to `QCA::SecureArray::~SecureArray()'
/usr/src/RPM/BUILD/oneclickftp-0.5.0/src/main.cpp:210: undefined reference to `QCA::SecureArray::~SecureArray()'
/usr/src/RPM/BUILD/oneclickftp-0.5.0/src/main.cpp:210: undefined reference to `QCA::Initializer::~Initializer()'
/usr/src/RPM/BUILD/oneclickftp-0.5.0/src/main.cpp:210: undefined reference to `QCA::Initializer::~Initializer()'
/usr/src/RPM/BUILD/oneclickftp-0.5.0/src/main.cpp:212: undefined reference to `QCA::Initializer::Initializer(QCA::MemoryMode, int)'
/usr/src/RPM/BUILD/oneclickftp-0.5.0/src/main.cpp:213: undefined reference to `QCA::Hash::Hash(QString const&, QString const&)'
/usr/src/RPM/BUILD/oneclickftp-0.5.0/src/main.cpp:214: undefined reference to `QCA::MemoryRegion::MemoryRegion(QByteArray const&)'
/usr/src/RPM/BUILD/oneclickftp-0.5.0/src/main.cpp:214: undefined reference to `QCA::Hash::hash(QCA::MemoryRegion const&)'
/usr/src/RPM/BUILD/oneclickftp-0.5.0/src/main.cpp:214: undefined reference to `QCA::MemoryRegion::toByteArray() const'
/usr/src/RPM/BUILD/oneclickftp-0.5.0/src/main.cpp:214: undefined reference to `QCA::MemoryRegion::~MemoryRegion()'
/usr/src/RPM/BUILD/oneclickftp-0.5.0/src/main.cpp:214: undefined reference to `QCA::MemoryRegion::~MemoryRegion()'
/usr/src/RPM/BUILD/oneclickftp-0.5.0/src/main.cpp:214: undefined reference to `QCA::MemoryRegion::~MemoryRegion()'
/usr/src/RPM/BUILD/oneclickftp-0.5.0/src/main.cpp:214: undefined reference to `QCA::MemoryRegion::~MemoryRegion()'
/usr/src/RPM/BUILD/oneclickftp-0.5.0/src/main.cpp:214: undefined reference to `QCA::Initializer::~Initializer()'
/usr/src/RPM/BUILD/oneclickftp-0.5.0/src/main.cpp:214: undefined reference to `QCA::Initializer::~Initializer()'
build/main.o: In function `~InitializationVector':
/usr/src/RPM/BUILD/oneclickftp-0.5.0/../../../../include/qt4/QtCrypto/qca_core.h:1214: undefined reference to `QCA::SecureArray::~SecureArray()'
build/main.o: In function `~SymmetricKey':
/usr/src/RPM/BUILD/oneclickftp-0.5.0/../../../../include/qt4/QtCrypto/qca_core.h:1168: undefined reference to `QCA::SecureArray::~SecureArray()'
build/mainwindowimpl.o: In function `MainWindowImpl::ExportProfilesButton()':
/usr/src/RPM/BUILD/oneclickftp-0.5.0/src/mainwindowimpl.cpp:755: undefined reference to `QCA::Initializer::Initializer(QCA::MemoryMode, int)'
/usr/src/RPM/BUILD/oneclickftp-0.5.0/src/mainwindowimpl.cpp:756: undefined reference to `QCA::SymmetricKey::SymmetricKey(QByteArray const&)'
/usr/src/RPM/BUILD/oneclickftp-0.5.0/src/mainwindowimpl.cpp:757: undefined reference to `QCA::InitializationVector::InitializationVector(QByteArray const&)'
/usr/src/RPM/BUILD/oneclickftp-0.5.0/src/mainwindowimpl.cpp:758: undefined reference to `QCA::Cipher::Cipher(QString const&, QCA::Cipher::Mode, QCA::Cipher::Padding, QCA::Direction, QCA::SymmetricKey const&, QCA::InitializationVector const&, QString const&)'
/usr/src/RPM/BUILD/oneclickftp-0.5.0/src/mainwindowimpl.cpp:759: undefined reference to `QCA::SecureArray::SecureArray(QByteArray const&)'
/usr/src/RPM/BUILD/oneclickftp-0.5.0/src/mainwindowimpl.cpp:759: undefined reference to `QCA::Filter::process(QCA::MemoryRegion const&)'
/usr/src/RPM/BUILD/oneclickftp-0.5.0/src/mainwindowimpl.cpp:759: undefined reference to `QCA::SecureArray::SecureArray(QCA::MemoryRegion const&)'
/usr/src/RPM/BUILD/oneclickftp-0.5.0/src/mainwindowimpl.cpp:759: undefined reference to `QCA::MemoryRegion::~MemoryRegion()'
/usr/src/RPM/BUILD/oneclickftp-0.5.0/src/mainwindowimpl.cpp:759: undefined reference to `QCA::MemoryRegion::~MemoryRegion()'
/usr/src/RPM/BUILD/oneclickftp-0.5.0/src/mainwindowimpl.cpp:759: undefined reference to `QCA::SecureArray::~SecureArray()'
/usr/src/RPM/BUILD/oneclickftp-0.5.0/src/mainwindowimpl.cpp:759: undefined reference to `QCA::SecureArray::~SecureArray()'
/usr/src/RPM/BUILD/oneclickftp-0.5.0/src/mainwindowimpl.cpp:765: undefined reference to `QCA::SecureArray::toByteArray() const'
/usr/src/RPM/BUILD/oneclickftp-0.5.0/src/mainwindowimpl.cpp:767: undefined reference to `QCA::SecureArray::~SecureArray()'
/usr/src/RPM/BUILD/oneclickftp-0.5.0/src/mainwindowimpl.cpp:767: undefined reference to `QCA::SecureArray::~SecureArray()'
/usr/src/RPM/BUILD/oneclickftp-0.5.0/src/mainwindowimpl.cpp:767: undefined reference to `QCA::Initializer::~Initializer()'
/usr/src/RPM/BUILD/oneclickftp-0.5.0/src/mainwindowimpl.cpp:767: undefined reference to `QCA::Initializer::~Initializer()'
build/mainwindowimpl.o: In function `MainWindowImpl::SaveProfiles()':
/usr/src/RPM/BUILD/oneclickftp-0.5.0/src/mainwindowimpl.cpp:525: undefined reference to `QCA::Initializer::Initializer(QCA::MemoryMode, int)'
/usr/src/RPM/BUILD/oneclickftp-0.5.0/src/mainwindowimpl.cpp:526: undefined reference to `QCA::SymmetricKey::SymmetricKey(QByteArray const&)'
/usr/src/RPM/BUILD/oneclickftp-0.5.0/src/mainwindowimpl.cpp:527: undefined reference to `QCA::InitializationVector::InitializationVector(QByteArray const&)'
/usr/src/RPM/BUILD/oneclickftp-0.5.0/src/mainwindowimpl.cpp:528: undefined reference to `QCA::Cipher::Cipher(QString const&, QCA::Cipher::Mode, QCA::Cipher::Padding, QCA::Direction, QCA::SymmetricKey const&, QCA::InitializationVector const&, QString const&)'
/usr/src/RPM/BUILD/oneclickftp-0.5.0/src/mainwindowimpl.cpp:529: undefined reference to `QCA::SecureArray::SecureArray(QByteArray const&)'
/usr/src/RPM/BUILD/oneclickftp-0.5.0/src/mainwindowimpl.cpp:529: undefined reference to `QCA::Filter::process(QCA::MemoryRegion const&)'
/usr/src/RPM/BUILD/oneclickftp-0.5.0/src/mainwindowimpl.cpp:529: undefined reference to `QCA::SecureArray::SecureArray(QCA::MemoryRegion const&)'
/usr/src/RPM/BUILD/oneclickftp-0.5.0/src/mainwindowimpl.cpp:529: undefined reference to `QCA::MemoryRegion::~MemoryRegion()'
/usr/src/RPM/BUILD/oneclickftp-0.5.0/src/mainwindowimpl.cpp:529: undefined reference to `QCA::MemoryRegion::~MemoryRegion()'
/usr/src/RPM/BUILD/oneclickftp-0.5.0/src/mainwindowimpl.cpp:529: undefined reference to `QCA::SecureArray::~SecureArray()'
/usr/src/RPM/BUILD/oneclickftp-0.5.0/src/mainwindowimpl.cpp:529: undefined reference to `QCA::SecureArray::~SecureArray()'
/usr/src/RPM/BUILD/oneclickftp-0.5.0/src/mainwindowimpl.cpp:533: undefined reference to `QCA::SecureArray::toByteArray() const'
/usr/src/RPM/BUILD/oneclickftp-0.5.0/src/mainwindowimpl.cpp:534: undefined reference to `QCA::SecureArray::~SecureArray()'
/usr/src/RPM/BUILD/oneclickftp-0.5.0/src/mainwindowimpl.cpp:534: undefined reference to `QCA::SecureArray::~SecureArray()'
/usr/src/RPM/BUILD/oneclickftp-0.5.0/src/mainwindowimpl.cpp:534: undefined reference to `QCA::Initializer::~Initializer()'
/usr/src/RPM/BUILD/oneclickftp-0.5.0/src/mainwindowimpl.cpp:534: undefined reference to `QCA::Initializer::~Initializer()'
build/mainwindowimpl.o: In function `MainWindowImpl::ImportProfilesButton()':
/usr/src/RPM/BUILD/oneclickftp-0.5.0/src/mainwindowimpl.cpp:780: undefined reference to `QCA::Initializer::Initializer(QCA::MemoryMode, int)'
/usr/src/RPM/BUILD/oneclickftp-0.5.0/src/mainwindowimpl.cpp:781: undefined reference to `QCA::SecureArray::SecureArray(QByteArray const&)'
/usr/src/RPM/BUILD/oneclickftp-0.5.0/src/mainwindowimpl.cpp:784: undefined reference to `QCA::SymmetricKey::SymmetricKey(QByteArray const&)'
/usr/src/RPM/BUILD/oneclickftp-0.5.0/src/mainwindowimpl.cpp:785: undefined reference to `QCA::InitializationVector::InitializationVector(QByteArray const&)'
/usr/src/RPM/BUILD/oneclickftp-0.5.0/src/mainwindowimpl.cpp:786: undefined reference to `QCA::Cipher::Cipher(QString const&, QCA::Cipher::Mode, QCA::Cipher::Padding, QCA::Direction, QCA::SymmetricKey const&, QCA::InitializationVector const&, QString const&)'
/usr/src/RPM/BUILD/oneclickftp-0.5.0/src/mainwindowimpl.cpp:788: undefined reference to `QCA::Filter::process(QCA::MemoryRegion const&)'
/usr/src/RPM/BUILD/oneclickftp-0.5.0/src/mainwindowimpl.cpp:788: undefined reference to `QCA::MemoryRegion::toByteArray() const'
/usr/src/RPM/BUILD/oneclickftp-0.5.0/src/mainwindowimpl.cpp:788: undefined reference to `QCA::MemoryRegion::~MemoryRegion()'
/usr/src/RPM/BUILD/oneclickftp-0.5.0/src/mainwindowimpl.cpp:788: undefined reference to `QCA::MemoryRegion::~MemoryRegion()'
/usr/src/RPM/BUILD/oneclickftp-0.5.0/src/mainwindowimpl.cpp:797: undefined reference to `QCA::SecureArray::~SecureArray()'
/usr/src/RPM/BUILD/oneclickftp-0.5.0/src/mainwindowimpl.cpp:797: undefined reference to `QCA::SecureArray::~SecureArray()'
/usr/src/RPM/BUILD/oneclickftp-0.5.0/src/mainwindowimpl.cpp:797: undefined reference to `QCA::Initializer::~Initializer()'
/usr/src/RPM/BUILD/oneclickftp-0.5.0/src/mainwindowimpl.cpp:797: undefined reference to `QCA::Initializer::~Initializer()'
build/mainwindowimpl.o: In function `MainWindowImpl::CheckForPassword(bool)':
/usr/src/RPM/BUILD/oneclickftp-0.5.0/src/mainwindowimpl.cpp:75: undefined reference to `QCA::Initializer::Initializer(QCA::MemoryMode, int)'
/usr/src/RPM/BUILD/oneclickftp-0.5.0/src/mainwindowimpl.cpp:76: undefined reference to `QCA::Hash::Hash(QString const&, QString const&)'
/usr/src/RPM/BUILD/oneclickftp-0.5.0/src/mainwindowimpl.cpp:87: undefined reference to `QCA::MemoryRegion::MemoryRegion(QByteArray const&)'
/usr/src/RPM/BUILD/oneclickftp-0.5.0/src/mainwindowimpl.cpp:87: undefined reference to `QCA::Hash::hash(QCA::MemoryRegion const&)'
/usr/src/RPM/BUILD/oneclickftp-0.5.0/src/mainwindowimpl.cpp:87: undefined reference to `QCA::MemoryRegion::toByteArray() const'
/usr/src/RPM/BUILD/oneclickftp-0.5.0/src/mainwindowimpl.cpp:87: undefined reference to `QCA::MemoryRegion::MemoryRegion(QByteArray const&)'
/usr/src/RPM/BUILD/oneclickftp-0.5.0/src/mainwindowimpl.cpp:87: undefined reference to `QCA::Hash::hash(QCA::MemoryRegion const&)'
/usr/src/RPM/BUILD/oneclickftp-0.5.0/src/mainwindowimpl.cpp:87: undefined reference to `QCA::MemoryRegion::toByteArray() const'
/usr/src/RPM/BUILD/oneclickftp-0.5.0/src/mainwindowimpl.cpp:87: undefined reference to `QCA::MemoryRegion::~MemoryRegion()'
/usr/src/RPM/BUILD/oneclickftp-0.5.0/src/mainwindowimpl.cpp:87: undefined reference to `QCA::MemoryRegion::~MemoryRegion()'
/usr/src/RPM/BUILD/oneclickftp-0.5.0/src/mainwindowimpl.cpp:87: undefined reference to `QCA::MemoryRegion::~MemoryRegion()'
/usr/src/RPM/BUILD/oneclickftp-0.5.0/src/mainwindowimpl.cpp:87: undefined reference to `QCA::MemoryRegion::~MemoryRegion()'
/usr/src/RPM/BUILD/oneclickftp-0.5.0/src/mainwindowimpl.cpp:87: undefined reference to `QCA::MemoryRegion::~MemoryRegion()'
build/mainwindowimpl.o:/usr/src/RPM/BUILD/oneclickftp-0.5.0/src/mainwindowimpl.cpp:87: more undefined references to `QCA::MemoryRegion::~MemoryRegion()' follow
build/mainwindowimpl.o: In function `MainWindowImpl::CheckForPassword(bool)':
/usr/src/RPM/BUILD/oneclickftp-0.5.0/src/mainwindowimpl.cpp:94: undefined reference to `QCA::MemoryRegion::MemoryRegion(QByteArray const&)'
/usr/src/RPM/BUILD/oneclickftp-0.5.0/src/mainwindowimpl.cpp:94: undefined reference to `QCA::Hash::hash(QCA::MemoryRegion const&)'
/usr/src/RPM/BUILD/oneclickftp-0.5.0/src/mainwindowimpl.cpp:94: undefined reference to `QCA::MemoryRegion::toByteArray() const'
/usr/src/RPM/BUILD/oneclickftp-0.5.0/src/mainwindowimpl.cpp:94: undefined reference to `QCA::MemoryRegion::~MemoryRegion()'
/usr/src/RPM/BUILD/oneclickftp-0.5.0/src/mainwindowimpl.cpp:94: undefined reference to `QCA::MemoryRegion::~MemoryRegion()'
/usr/src/RPM/BUILD/oneclickftp-0.5.0/src/mainwindowimpl.cpp:94: undefined reference to `QCA::MemoryRegion::~MemoryRegion()'
/usr/src/RPM/BUILD/oneclickftp-0.5.0/src/mainwindowimpl.cpp:94: undefined reference to `QCA::MemoryRegion::~MemoryRegion()'
/usr/src/RPM/BUILD/oneclickftp-0.5.0/src/mainwindowimpl.cpp:98: undefined reference to `QCA::Initializer::~Initializer()'
/usr/src/RPM/BUILD/oneclickftp-0.5.0/src/mainwindowimpl.cpp:98: undefined reference to `QCA::Initializer::~Initializer()'
build/settingsimpl.o: In function `SettingsImpl::OKButton()':
/usr/src/RPM/BUILD/oneclickftp-0.5.0/src/settingsimpl.cpp:117: undefined reference to `QCA::Initializer::Initializer(QCA::MemoryMode, int)'
/usr/src/RPM/BUILD/oneclickftp-0.5.0/src/settingsimpl.cpp:119: undefined reference to `QCA::Hash::Hash(QString const&, QString const&)'
/usr/src/RPM/BUILD/oneclickftp-0.5.0/src/settingsimpl.cpp:122: undefined reference to `QCA::MemoryRegion::MemoryRegion(QByteArray const&)'
/usr/src/RPM/BUILD/oneclickftp-0.5.0/src/settingsimpl.cpp:122: undefined reference to `QCA::Hash::hash(QCA::MemoryRegion const&)'
/usr/src/RPM/BUILD/oneclickftp-0.5.0/src/settingsimpl.cpp:122: undefined reference to `QCA::MemoryRegion::toByteArray() const'
/usr/src/RPM/BUILD/oneclickftp-0.5.0/src/settingsimpl.cpp:122: undefined reference to `QCA::MemoryRegion::~MemoryRegion()'
/usr/src/RPM/BUILD/oneclickftp-0.5.0/src/settingsimpl.cpp:122: undefined reference to `QCA::MemoryRegion::~MemoryRegion()'
/usr/src/RPM/BUILD/oneclickftp-0.5.0/src/settingsimpl.cpp:122: undefined reference to `QCA::MemoryRegion::~MemoryRegion()'
/usr/src/RPM/BUILD/oneclickftp-0.5.0/src/settingsimpl.cpp:122: undefined reference to `QCA::MemoryRegion::~MemoryRegion()'
/usr/src/RPM/BUILD/oneclickftp-0.5.0/src/settingsimpl.cpp:126: undefined reference to `QCA::MemoryRegion::MemoryRegion(QByteArray const&)'
/usr/src/RPM/BUILD/oneclickftp-0.5.0/src/settingsimpl.cpp:126: undefined reference to `QCA::Hash::hash(QCA::MemoryRegion const&)'
/usr/src/RPM/BUILD/oneclickftp-0.5.0/src/settingsimpl.cpp:126: undefined reference to `QCA::MemoryRegion::toByteArray() const'
/usr/src/RPM/BUILD/oneclickftp-0.5.0/src/settingsimpl.cpp:126: undefined reference to `QCA::MemoryRegion::~MemoryRegion()'
/usr/src/RPM/BUILD/oneclickftp-0.5.0/src/settingsimpl.cpp:126: undefined reference to `QCA::MemoryRegion::~MemoryRegion()'
/usr/src/RPM/BUILD/oneclickftp-0.5.0/src/settingsimpl.cpp:126: undefined reference to `QCA::MemoryRegion::~MemoryRegion()'
/usr/src/RPM/BUILD/oneclickftp-0.5.0/src/settingsimpl.cpp:126: undefined reference to `QCA::MemoryRegion::~MemoryRegion()'
/usr/src/RPM/BUILD/oneclickftp-0.5.0/src/settingsimpl.cpp:128: undefined reference to `QCA::Hash::Hash(QString const&, QString const&)'
/usr/src/RPM/BUILD/oneclickftp-0.5.0/src/settingsimpl.cpp:131: undefined reference to `QCA::MemoryRegion::MemoryRegion(QByteArray const&)'
/usr/src/RPM/BUILD/oneclickftp-0.5.0/src/settingsimpl.cpp:131: undefined reference to `QCA::Hash::hash(QCA::MemoryRegion const&)'
/usr/src/RPM/BUILD/oneclickftp-0.5.0/src/settingsimpl.cpp:131: undefined reference to `QCA::MemoryRegion::toByteArray() const'
/usr/src/RPM/BUILD/oneclickftp-0.5.0/src/settingsimpl.cpp:131: undefined reference to `QCA::MemoryRegion::~MemoryRegion()'
/usr/src/RPM/BUILD/oneclickftp-0.5.0/src/settingsimpl.cpp:131: undefined reference to `QCA::MemoryRegion::~MemoryRegion()'
/usr/src/RPM/BUILD/oneclickftp-0.5.0/src/settingsimpl.cpp:131: undefined reference to `QCA::MemoryRegion::~MemoryRegion()'
/usr/src/RPM/BUILD/oneclickftp-0.5.0/src/settingsimpl.cpp:131: undefined reference to `QCA::MemoryRegion::~MemoryRegion()'
/usr/src/RPM/BUILD/oneclickftp-0.5.0/src/settingsimpl.cpp:135: undefined reference to `QCA::Hash::Hash(QString const&, QString const&)'
/usr/src/RPM/BUILD/oneclickftp-0.5.0/src/settingsimpl.cpp:138: undefined reference to `QCA::MemoryRegion::MemoryRegion(QByteArray const&)'
/usr/src/RPM/BUILD/oneclickftp-0.5.0/src/settingsimpl.cpp:138: undefined reference to `QCA::Hash::hash(QCA::MemoryRegion const&)'
/usr/src/RPM/BUILD/oneclickftp-0.5.0/src/settingsimpl.cpp:138: undefined reference to `QCA::MemoryRegion::toByteArray() const'
/usr/src/RPM/BUILD/oneclickftp-0.5.0/src/settingsimpl.cpp:138: undefined reference to `QCA::MemoryRegion::~MemoryRegion()'
/usr/src/RPM/BUILD/oneclickftp-0.5.0/src/settingsimpl.cpp:138: undefined reference to `QCA::MemoryRegion::~MemoryRegion()'
/usr/src/RPM/BUILD/oneclickftp-0.5.0/src/settingsimpl.cpp:138: undefined reference to `QCA::MemoryRegion::~MemoryRegion()'
/usr/src/RPM/BUILD/oneclickftp-0.5.0/src/settingsimpl.cpp:138: undefined reference to `QCA::MemoryRegion::~MemoryRegion()'
/usr/src/RPM/BUILD/oneclickftp-0.5.0/src/settingsimpl.cpp:142: undefined reference to `QCA::MemoryRegion::MemoryRegion(QByteArray const&)'
/usr/src/RPM/BUILD/oneclickftp-0.5.0/src/settingsimpl.cpp:142: undefined reference to `QCA::Hash::hash(QCA::MemoryRegion const&)'
/usr/src/RPM/BUILD/oneclickftp-0.5.0/src/settingsimpl.cpp:142: undefined reference to `QCA::MemoryRegion::toByteArray() const'
/usr/src/RPM/BUILD/oneclickftp-0.5.0/src/settingsimpl.cpp:142: undefined reference to `QCA::MemoryRegion::~MemoryRegion()'
/usr/src/RPM/BUILD/oneclickftp-0.5.0/src/settingsimpl.cpp:142: undefined reference to `QCA::MemoryRegion::~MemoryRegion()'
/usr/src/RPM/BUILD/oneclickftp-0.5.0/src/settingsimpl.cpp:142: undefined reference to `QCA::MemoryRegion::~MemoryRegion()'
/usr/src/RPM/BUILD/oneclickftp-0.5.0/src/settingsimpl.cpp:142: undefined reference to `QCA::MemoryRegion::~MemoryRegion()'
/usr/src/RPM/BUILD/oneclickftp-0.5.0/src/settingsimpl.cpp:144: undefined reference to `QCA::Hash::Hash(QString const&, QString const&)'
/usr/src/RPM/BUILD/oneclickftp-0.5.0/src/settingsimpl.cpp:147: undefined reference to `QCA::MemoryRegion::MemoryRegion(QByteArray const&)'
/usr/src/RPM/BUILD/oneclickftp-0.5.0/src/settingsimpl.cpp:147: undefined reference to `QCA::Hash::hash(QCA::MemoryRegion const&)'
/usr/src/RPM/BUILD/oneclickftp-0.5.0/src/settingsimpl.cpp:147: undefined reference to `QCA::MemoryRegion::toByteArray() const'
/usr/src/RPM/BUILD/oneclickftp-0.5.0/src/settingsimpl.cpp:147: undefined reference to `QCA::MemoryRegion::~MemoryRegion()'
/usr/src/RPM/BUILD/oneclickftp-0.5.0/src/settingsimpl.cpp:147: undefined reference to `QCA::MemoryRegion::~MemoryRegion()'
/usr/src/RPM/BUILD/oneclickftp-0.5.0/src/settingsimpl.cpp:147: undefined reference to `QCA::MemoryRegion::~MemoryRegion()'
/usr/src/RPM/BUILD/oneclickftp-0.5.0/src/settingsimpl.cpp:147: undefined reference to `QCA::MemoryRegion::~MemoryRegion()'
/usr/src/RPM/BUILD/oneclickftp-0.5.0/src/settingsimpl.cpp:163: undefined reference to `QCA::Initializer::~Initializer()'
/usr/src/RPM/BUILD/oneclickftp-0.5.0/src/settingsimpl.cpp:163: undefined reference to `QCA::Initializer::~Initializer()'
build/settingsimpl.o: In function `SettingsImpl':
/usr/src/RPM/BUILD/oneclickftp-0.5.0/src/settingsimpl.cpp:54: undefined reference to `QCA::Initializer::Initializer(QCA::MemoryMode, int)'
/usr/src/RPM/BUILD/oneclickftp-0.5.0/src/settingsimpl.cpp:55: undefined reference to `QCA::Hash::Hash(QString const&, QString const&)'
/usr/src/RPM/BUILD/oneclickftp-0.5.0/src/settingsimpl.cpp:56: undefined reference to `QCA::MemoryRegion::MemoryRegion(QByteArray const&)'
/usr/src/RPM/BUILD/oneclickftp-0.5.0/src/settingsimpl.cpp:56: undefined reference to `QCA::Hash::hash(QCA::MemoryRegion const&)'
/usr/src/RPM/BUILD/oneclickftp-0.5.0/src/settingsimpl.cpp:56: undefined reference to `QCA::MemoryRegion::toByteArray() const'
/usr/src/RPM/BUILD/oneclickftp-0.5.0/src/settingsimpl.cpp:56: undefined reference to `QCA::MemoryRegion::MemoryRegion(QByteArray const&)'
/usr/src/RPM/BUILD/oneclickftp-0.5.0/src/settingsimpl.cpp:56: undefined reference to `QCA::Hash::hash(QCA::MemoryRegion const&)'
/usr/src/RPM/BUILD/oneclickftp-0.5.0/src/settingsimpl.cpp:56: undefined reference to `QCA::MemoryRegion::toByteArray() const'
/usr/src/RPM/BUILD/oneclickftp-0.5.0/src/settingsimpl.cpp:56: undefined reference to `QCA::MemoryRegion::~MemoryRegion()'
/usr/src/RPM/BUILD/oneclickftp-0.5.0/src/settingsimpl.cpp:56: undefined reference to `QCA::MemoryRegion::~MemoryRegion()'
/usr/src/RPM/BUILD/oneclickftp-0.5.0/src/settingsimpl.cpp:56: undefined reference to `QCA::MemoryRegion::~MemoryRegion()'
/usr/src/RPM/BUILD/oneclickftp-0.5.0/src/settingsimpl.cpp:56: undefined reference to `QCA::MemoryRegion::~MemoryRegion()'
/usr/src/RPM/BUILD/oneclickftp-0.5.0/src/settingsimpl.cpp:56: undefined reference to `QCA::MemoryRegion::~MemoryRegion()'
build/settingsimpl.o:/usr/src/RPM/BUILD/oneclickftp-0.5.0/src/settingsimpl.cpp:56: more undefined references to `QCA::MemoryRegion::~MemoryRegion()' follow
build/settingsimpl.o: In function `SettingsImpl':
/usr/src/RPM/BUILD/oneclickftp-0.5.0/src/settingsimpl.cpp:58: undefined reference to `QCA::MemoryRegion::MemoryRegion(QByteArray const&)'
/usr/src/RPM/BUILD/oneclickftp-0.5.0/src/settingsimpl.cpp:58: undefined reference to `QCA::Hash::hash(QCA::MemoryRegion const&)'
/usr/src/RPM/BUILD/oneclickftp-0.5.0/src/settingsimpl.cpp:58: undefined reference to `QCA::MemoryRegion::toByteArray() const'
/usr/src/RPM/BUILD/oneclickftp-0.5.0/src/settingsimpl.cpp:58: undefined reference to `QCA::MemoryRegion::MemoryRegion(QByteArray const&)'
/usr/src/RPM/BUILD/oneclickftp-0.5.0/src/settingsimpl.cpp:58: undefined reference to `QCA::Hash::hash(QCA::MemoryRegion const&)'
/usr/src/RPM/BUILD/oneclickftp-0.5.0/src/settingsimpl.cpp:58: undefined reference to `QCA::MemoryRegion::toByteArray() const'
/usr/src/RPM/BUILD/oneclickftp-0.5.0/src/settingsimpl.cpp:58: undefined reference to `QCA::MemoryRegion::~MemoryRegion()'
/usr/src/RPM/BUILD/oneclickftp-0.5.0/src/settingsimpl.cpp:58: undefined reference to `QCA::MemoryRegion::~MemoryRegion()'
/usr/src/RPM/BUILD/oneclickftp-0.5.0/src/settingsimpl.cpp:58: undefined reference to `QCA::MemoryRegion::~MemoryRegion()'
/usr/src/RPM/BUILD/oneclickftp-0.5.0/src/settingsimpl.cpp:58: undefined reference to `QCA::MemoryRegion::~MemoryRegion()'
/usr/src/RPM/BUILD/oneclickftp-0.5.0/src/settingsimpl.cpp:58: undefined reference to `QCA::MemoryRegion::~MemoryRegion()'
build/settingsimpl.o:/usr/src/RPM/BUILD/oneclickftp-0.5.0/src/settingsimpl.cpp:58: more undefined references to `QCA::MemoryRegion::~MemoryRegion()' follow
build/settingsimpl.o: In function `SettingsImpl':
/usr/src/RPM/BUILD/oneclickftp-0.5.0/src/settingsimpl.cpp:59: undefined reference to `QCA::Initializer::~Initializer()'
/usr/src/RPM/BUILD/oneclickftp-0.5.0/src/settingsimpl.cpp:59: undefined reference to `QCA::Initializer::~Initializer()'
/usr/src/RPM/BUILD/oneclickftp-0.5.0/src/settingsimpl.cpp:54: undefined reference to `QCA::Initializer::Initializer(QCA::MemoryMode, int)'
/usr/src/RPM/BUILD/oneclickftp-0.5.0/src/settingsimpl.cpp:55: undefined reference to `QCA::Hash::Hash(QString const&, QString const&)'
/usr/src/RPM/BUILD/oneclickftp-0.5.0/src/settingsimpl.cpp:56: undefined reference to `QCA::MemoryRegion::MemoryRegion(QByteArray const&)'
/usr/src/RPM/BUILD/oneclickftp-0.5.0/src/settingsimpl.cpp:56: undefined reference to `QCA::Hash::hash(QCA::MemoryRegion const&)'
/usr/src/RPM/BUILD/oneclickftp-0.5.0/src/settingsimpl.cpp:56: undefined reference to `QCA::MemoryRegion::toByteArray() const'
/usr/src/RPM/BUILD/oneclickftp-0.5.0/src/settingsimpl.cpp:56: undefined reference to `QCA::MemoryRegion::MemoryRegion(QByteArray const&)'
/usr/src/RPM/BUILD/oneclickftp-0.5.0/src/settingsimpl.cpp:56: undefined reference to `QCA::Hash::hash(QCA::MemoryRegion const&)'
/usr/src/RPM/BUILD/oneclickftp-0.5.0/src/settingsimpl.cpp:56: undefined reference to `QCA::MemoryRegion::toByteArray() const'
/usr/src/RPM/BUILD/oneclickftp-0.5.0/src/settingsimpl.cpp:56: undefined reference to `QCA::MemoryRegion::~MemoryRegion()'
/usr/src/RPM/BUILD/oneclickftp-0.5.0/src/settingsimpl.cpp:56: undefined reference to `QCA::MemoryRegion::~MemoryRegion()'
/usr/src/RPM/BUILD/oneclickftp-0.5.0/src/settingsimpl.cpp:56: undefined reference to `QCA::MemoryRegion::~MemoryRegion()'
/usr/src/RPM/BUILD/oneclickftp-0.5.0/src/settingsimpl.cpp:56: undefined reference to `QCA::MemoryRegion::~MemoryRegion()'
/usr/src/RPM/BUILD/oneclickftp-0.5.0/src/settingsimpl.cpp:56: undefined reference to `QCA::MemoryRegion::~MemoryRegion()'
build/settingsimpl.o:/usr/src/RPM/BUILD/oneclickftp-0.5.0/src/settingsimpl.cpp:56: more undefined references to `QCA::MemoryRegion::~MemoryRegion()' follow
build/settingsimpl.o: In function `SettingsImpl':
/usr/src/RPM/BUILD/oneclickftp-0.5.0/src/settingsimpl.cpp:58: undefined reference to `QCA::MemoryRegion::MemoryRegion(QByteArray const&)'
/usr/src/RPM/BUILD/oneclickftp-0.5.0/src/settingsimpl.cpp:58: undefined reference to `QCA::Hash::hash(QCA::MemoryRegion const&)'
/usr/src/RPM/BUILD/oneclickftp-0.5.0/src/settingsimpl.cpp:58: undefined reference to `QCA::MemoryRegion::toByteArray() const'
/usr/src/RPM/BUILD/oneclickftp-0.5.0/src/settingsimpl.cpp:58: undefined reference to `QCA::MemoryRegion::MemoryRegion(QByteArray const&)'
/usr/src/RPM/BUILD/oneclickftp-0.5.0/src/settingsimpl.cpp:58: undefined reference to `QCA::Hash::hash(QCA::MemoryRegion const&)'
/usr/src/RPM/BUILD/oneclickftp-0.5.0/src/settingsimpl.cpp:58: undefined reference to `QCA::MemoryRegion::toByteArray() const'
/usr/src/RPM/BUILD/oneclickftp-0.5.0/src/settingsimpl.cpp:58: undefined reference to `QCA::MemoryRegion::~MemoryRegion()'
/usr/src/RPM/BUILD/oneclickftp-0.5.0/src/settingsimpl.cpp:58: undefined reference to `QCA::MemoryRegion::~MemoryRegion()'
/usr/src/RPM/BUILD/oneclickftp-0.5.0/src/settingsimpl.cpp:58: undefined reference to `QCA::MemoryRegion::~MemoryRegion()'
/usr/src/RPM/BUILD/oneclickftp-0.5.0/src/settingsimpl.cpp:58: undefined reference to `QCA::MemoryRegion::~MemoryRegion()'
/usr/src/RPM/BUILD/oneclickftp-0.5.0/src/settingsimpl.cpp:58: undefined reference to `QCA::MemoryRegion::~MemoryRegion()'
build/settingsimpl.o:/usr/src/RPM/BUILD/oneclickftp-0.5.0/src/settingsimpl.cpp:58: more undefined references to `QCA::MemoryRegion::~MemoryRegion()' follow
build/settingsimpl.o: In function `SettingsImpl':
/usr/src/RPM/BUILD/oneclickftp-0.5.0/src/settingsimpl.cpp:59: undefined reference to `QCA::Initializer::~Initializer()'
/usr/src/RPM/BUILD/oneclickftp-0.5.0/src/settingsimpl.cpp:59: undefined reference to `QCA::Initializer::~Initializer()'
collect2: ld returned 1 exit status
make: *** [bin/oneclickftp] Error 1


rpm -qa | grep qca
libqca2-2.0.1-alt0.M41.1
libqca2-devel-2.0.1-alt0.M41.1
libqca-devel-1.0-alt3
libqca-1.0-alt3

rpm -q libqt4-devel
libqt4-devel-4.4.3-alt1.M41.1 - May 13 2009
MyMediaPlayer

Audio Apps by drue 11 comments

There are any ideas as it to correct? - May 13 2009
MyMediaPlayer

Audio Apps by drue 11 comments

- Distribution
- qt version
- amarok version

- ALT Linux 4.1.1
- rpm -q libqt4-devel
libqt4-devel-4.4.3-alt1.M41.1
- amarok not installed into virtual building environment.

I maked changes for building for ALT Linux:
=================================
gendiff MyMediaPlayer .orig
--- MyMediaPlayer/MyMediaPlayer.pro.orig 2009-03-02 21:14:26 +0300
+++ MyMediaPlayer/MyMediaPlayer.pro 2009-05-13 11:07:28 +0400
@@ -28,7 +28,7 @@ HEADERS += labelPlayer.h \
quick_dirty.h \
jobs.h
FORMS +=
-INCLUDEPATH += /usr/include/QtCrypto
+INCLUDEPATH += /usr/include/qt4/QtCrypto
LIBS += -L/usr/lib \
-lqca
RESOURCES += application.qrc
--- MyMediaPlayer/labelPlayer.h.orig 2009-03-26 16:35:15 +0300
+++ MyMediaPlayer/labelPlayer.h 2009-05-13 11:20:59 +0400
@@ -26,9 +26,9 @@
#include <QPushButton>
#include <QLabel>

-#include <phonon/phononnamespace.h>
-#include <phonon/mediaobject.h>
-#include <phonon/audiooutput.h>
+#include <kde4/phonon/phononnamespace.h>
+#include <kde4/phonon/mediaobject.h>
+#include <kde4/phonon/audiooutput.h>

#include <time.h>
- May 13 2009
NetFleet

Network by lsn752 13 comments

qmake-qt4 ./netfleet.pro
[builder@bersud netfleet_0.1.3]$ make
/usr/lib/qt4/bin/uic ui/newtask.ui -o build/ui_newtask.h
/usr/lib/qt4/bin/uic ui/preferences.ui -o build/ui_preferences.h
/usr/lib/qt4/bin/uic ui/delete.ui -o build/ui_delete.h
/usr/lib/qt4/bin/uic ui/about.ui -o build/ui_about.h
g++ -c -pipe -Wall -W -D_REENTRANT -DQT_NO_DEBUG -DQT_GUI_LIB -DQT_NETWORK_LIB -DQT_CORE_LIB -I../../../../share/qt4/mkspecs/linux-g++ -I. -I../../../../include/qt4/QtCore -I../../../../include/qt4/QtCore -I../../../../include/qt4/QtNetwork -I../../../../include/qt4/QtNetwork -I../../../../include/qt4/QtGui -I../../../../include/qt4/QtGui -I../../../../include/qt4 -Ibuild -Ibuild -o build/main.o src/main.cpp
g++ -c -pipe -Wall -W -D_REENTRANT -DQT_NO_DEBUG -DQT_GUI_LIB -DQT_NETWORK_LIB -DQT_CORE_LIB -I../../../../share/qt4/mkspecs/linux-g++ -I. -I../../../../include/qt4/QtCore -I../../../../include/qt4/QtCore -I../../../../include/qt4/QtNetwork -I../../../../include/qt4/QtNetwork -I../../../../include/qt4/QtGui -I../../../../include/qt4/QtGui -I../../../../include/qt4 -Ibuild -Ibuild -o build/mainwindow.o src/mainwindow.cpp
src/mainwindow.cpp:1413: warning: unused parameter 'row'
src/mainwindow.cpp:1413: warning: unused parameter 'column'
g++ -c -pipe -Wall -W -D_REENTRANT -DQT_NO_DEBUG -DQT_GUI_LIB -DQT_NETWORK_LIB -DQT_CORE_LIB -I../../../../share/qt4/mkspecs/linux-g++ -I. -I../../../../include/qt4/QtCore -I../../../../include/qt4/QtCore -I../../../../include/qt4/QtNetwork -I../../../../include/qt4/QtNetwork -I../../../../include/qt4/QtGui -I../../../../include/qt4/QtGui -I../../../../include/qt4 -Ibuild -Ibuild -o build/newtaskdialog.o src/newtaskdialog.cpp
src/newtaskdialog.cpp: In constructor 'NewTaskDialog::NewTaskDialog(QString, QWidget*, Qt::WFlags)':
src/newtaskdialog.cpp:24: error: invalid use of undefined type 'struct QHeaderView'
../../../../include/qt4/QtGui/qtableview.h:51: error: forward declaration of 'struct QHeaderView'
src/newtaskdialog.cpp:25: error: invalid use of undefined type 'struct QHeaderView'
../../../../include/qt4/QtGui/qtableview.h:51: error: forward declaration of 'struct QHeaderView'
src/newtaskdialog.cpp:26: error: invalid use of undefined type 'struct QHeaderView'
../../../../include/qt4/QtGui/qtableview.h:51: error: forward declaration of 'struct QHeaderView'
src/newtaskdialog.cpp: At global scope:
src/newtaskdialog.cpp:58: warning: unused parameter 'row'
make: *** [build/newtaskdialog.o] Error 1

OS - ALT Linux 4.1

rpm -qa | grep libqt4-devel
libqt4-devel-4.4.3-alt1.M41.1 - Apr 30 2009
MyMediaPlayer

Audio Apps by drue 11 comments

ty.o jobs.o moc_labelPlayer.o moc_effects.o moc_database.o moc_labelGenre.o moc_myClasses.o moc_labelMusik.o moc_pictureflow.o moc_mymediaplayer.o moc_quick_dirty.o moc_jobs.o qrc_application.o -L/usr/lib -L/usr/X11R6/lib -L/usr/lib -lqca -lphonon -lQtSql -lQtOpenGL -lQtGui -lQtCore -lGLU -lGL -lpthread
database.o: In function `DataBase::md5sum(QString)':
database.cpp:(.text+0x3a): undefined reference to `QCA::Hash::Hash(QString const&, QString const&)'
database.cpp:(.text+0x85): undefined reference to `QCA::Hex::Hex(QCA::Direction)'
database.cpp:(.text+0xe2): undefined reference to `QCA::Hash::update(QByteArray const&)'
database.cpp:(.text+0x165): undefined reference to `QCA::TextFilter::arrayToString(QCA::MemoryRegion const&)'
database.cpp:(.text+0x174): undefined reference to `QCA::MemoryRegion::~MemoryRegion()'
database.cpp:(.text+0x18b): undefined reference to `QCA::MemoryRegion::~MemoryRegion()'
database.o: In function `DataBase::~DataBase()':
database.cpp:(.text+0x6b13): undefined reference to `QCA::Initializer::~Initializer()'
database.cpp:(.text+0x6b32): undefined reference to `QCA::Initializer::~Initializer()'
database.o: In function `DataBase::~DataBase()':
database.cpp:(.text+0x6bcb): undefined reference to `QCA::Initializer::~Initializer()'
database.cpp:(.text+0x6bea): undefined reference to `QCA::Initializer::~Initializer()'
database.o: In function `DataBase::~DataBase()':
database.cpp:(.text+0x6c83): undefined reference to `QCA::Initializer::~Initializer()'
database.o:database.cpp:(.text+0x6ca2): more undefined references to `QCA::Initializer::~Initializer()' follow
database.o: In function `DataBase::DataBase()':
database.cpp:(.text+0x6d39): undefined reference to `QCA::Initializer::Initializer(QCA::MemoryMode, int)'
database.cpp:(.text+0x6f1b): undefined reference to `QCA::Hash::supportedTypes(QString const&)'
database.cpp:(.text+0x6f8c): undefined reference to `QCA::Initializer::~Initializer()'
database.o: In function `DataBase::DataBase()':
database.cpp:(.text+0x6ff1): undefined reference to `QCA::Initializer::Initializer(QCA::MemoryMode, int)'
database.cpp:(.text+0x71d3): undefined reference to `QCA::Hash::supportedTypes(QString const&)'
database.cpp:(.text+0x7244): undefined reference to `QCA::Initializer::~Initializer()'
database.o: In function `QCA::TextFilter::~TextFilter()':
database.cpp:(.text._ZN3QCA10TextFilterD2Ev[QCA::TextFilter::~TextFilter()]+0x18): undefined reference to `QCA::Filter::~Filter()'
database.o: In function `QCA::Hex::~Hex()':
database.cpp:(.text._ZN3QCA3HexD1Ev[QCA::Hex::~Hex()]+0x7): undefined reference to `vtable for QCA::Hex'
database.o: In function `QCA::TextFilter::~TextFilter()':
database.cpp:(.text._ZN3QCA10TextFilterD0Ev[QCA::TextFilter::~TextFilter()]+0x18): undefined reference to `QCA::Filter::~Filter()'
database.o: In function `QCA::TextFilter::~TextFilter()':
database.cpp:(.text._ZN3QCA10TextFilterD1Ev[QCA::TextFilter::~TextFilter()]+0x18): undefined reference to `QCA::Filter::~Filter()'
database.o:(.rodata._ZTIN3QCA10TextFilterE[typeinfo for QCA::TextFilter]+0x8): undefined reference to `typeinfo for QCA::Filter'
collect2: ld returned 1 exit status
make: *** [MyMediaPlayer] Error 1
[builder@bersud MyMediaPlayer]$
[builder@bersud MyMediaPlayer]$ mc
Cannot open master side of pty: No such file or directory (2)

[builder@bersud usr]$ rpm -qa | grep qca
libqca2-devel-2.0.1-alt0.M41.1
libqca-1.0-alt3
libqca2-2.0.1-alt0.M41.1
libqca-devel-1.0-alt3
[builder@bersud usr]$ findsym QCA
[builder@bersud usr]$
- Mar 27 2009