Image 01
profile-image

baghera

Federico Chiacchiaretta , Italy
test
Drive I/O System Monitor Plasmoid

System Software 28 comments

Score 77.1%
May 30 2013
Ops, that malformed patch error was my fault, sorry.
BTW, this patch is working properly http://pastebin.com/87fAu4Un

I just fixed the diff mess, and there were also two switched lines in driveio.cpp patch.

Thanks for your support! - Jan 29 2011
Hi, thanks for providing the patch. I think you messed up the file order in diff when you created the patch file, since it tells me that the patch was previously applied. Anyway, I applied it using -R flag and I got this:

patching file applet.h
patching file driveio.cpp
patch: **** malformed patch at line 130: align=\"right\">%3</td><td>KiB/s</td></tr>")

Thanks. - Jan 29 2011
Hi, as you might expect building plasmoid under kde 4.6 fails.

Here's the build error:

Linking CXX shared module lib/plasma_applet_sm_driveio.so
CMakeFiles/plasma_applet_sm_driveio.dir/driveio.o: In function `SM::Driveio::addMeter(QString const&)':
/home/federico/driveio/src/plasma-applet-sm_driveio/driveio.cpp:97: undefined reference to `SM::Applet::appendPlotter(QString const&, SM::Plotter*)'
CMakeFiles/plasma_applet_sm_driveio.dir/driveio.o: In function `SM::Driveio::dataUpdated(QString const&, QHash<QString, QVariant> const&)':
/home/federico/driveio/src/plasma-applet-sm_driveio/driveio.cpp:117: undefined reference to `SM::Applet::plotters()'
CMakeFiles/plasma_applet_sm_driveio.dir/driveio.o:(.data.rel.ro._ZTVN2SM7DriveioE[vtable for SM::Driveio]+0x108): undefined reference to `SM::Applet::deleteMeters()'
collect2: ld returned 1 exit status
make[2]: *** [lib/plasma_applet_sm_driveio.so] Error 1
make[1]: *** [CMakeFiles/plasma_applet_sm_driveio.dir/all] Error 2
make: *** [all] Error 2 - Jan 29 2011