Image 01
profile-image

CharlesT

Charles Bell Holly Hill, United States of America
Wallpaper Other
Currency

Plasma 4 Widgets 9 comments

Score 50.0%
Mar 04 2016
Actually, that was the .deb file. I downloaded the .tar.gz file and compiled and installed from there. That does give me the proper output.
I am using Kubuntu 14.04 LST - Apr 09 2016
I have a screen capture of the results of 0.2.2
Let me know where to send it if you wish to see what I am getting with the current version of CurrencyPlasmoid. - Apr 09 2016
The results output on the commandline:

cmake -DCMAKE_INSTALL_PREFIX='kde4-config --prefix' ..
-- The C compiler identification is GNU 4.8.4
-- The CXX compiler identification is GNU 4.8.4
-- Check for working C compiler: /usr/bin/cc
-- Check for working C compiler: /usr/bin/cc -- works
-- Detecting C compiler ABI info
-- Detecting C compiler ABI info - done
-- Check for working CXX compiler: /usr/bin/c++
-- Check for working CXX compiler: /usr/bin/c++ -- works
-- Detecting CXX compiler ABI info
-- Detecting CXX compiler ABI info - done
-- Looking for Q_WS_X11
-- Looking for Q_WS_X11 - found
-- Looking for Q_WS_WIN
-- Looking for Q_WS_WIN - not found
-- Looking for Q_WS_QWS
-- Looking for Q_WS_QWS - not found
-- Looking for Q_WS_MAC
-- Looking for Q_WS_MAC - not found
-- Found Qt-Version 4.8.6 (using /usr/bin/qmake)
-- Looking for XOpenDisplay in /usr/lib/x86_64-linux-gnu/libX11.so;/usr/lib/x86_64-linux-gnu/libXext.so;/usr/lib/x86_64-linux-gnu/libXft.so;/usr/lib/x86_64-linux-gnu/libXau.so;/usr/lib/x86_64-linux-gnu/libXdmcp.so;/usr/lib/x86_64-linux-gnu/libXpm.so
-- Looking for XOpenDisplay in /usr/lib/x86_64-linux-gnu/libX11.so;/usr/lib/x86_64-linux-gnu/libXext.so;/usr/lib/x86_64-linux-gnu/libXft.so;/usr/lib/x86_64-linux-gnu/libXau.so;/usr/lib/x86_64-linux-gnu/libXdmcp.so;/usr/lib/x86_64-linux-gnu/libXpm.so - found
-- Looking for gethostbyname
-- Looking for gethostbyname - found
-- Looking for connect
-- Looking for connect - found
-- Looking for remove
-- Looking for remove - found
-- Looking for shmat
-- Looking for shmat - found
-- Looking for IceConnectionNumber in ICE
-- Looking for IceConnectionNumber in ICE - found
-- Found X11: /usr/lib/x86_64-linux-gnu/libX11.so
-- Looking for include file pthread.h
-- Looking for include file pthread.h - found
-- Looking for pthread_create
-- Looking for pthread_create - not found
-- Looking for pthread_create in pthreads
-- Looking for pthread_create in pthreads - not found
-- Looking for pthread_create in pthread
-- Looking for pthread_create in pthread - found
-- Found Threads: TRUE
-- Looking for _POSIX_TIMERS
-- Looking for _POSIX_TIMERS - found
-- Found Automoc4: /usr/bin/automoc4
-- Found Perl: /usr/bin/perl (found version "5.18.2")
-- Found Phonon: /usr/include (Required is at least version "4.3.80")
-- Performing Test _OFFT_IS_64BIT
-- Performing Test _OFFT_IS_64BIT - Success
-- Performing Test HAVE_FPIE_SUPPORT
-- Performing Test HAVE_FPIE_SUPPORT - Success
-- Performing Test __KDE_HAVE_W_OVERLOADED_VIRTUAL
-- Performing Test __KDE_HAVE_W_OVERLOADED_VIRTUAL - Success
-- Performing Test __KDE_HAVE_GCC_VISIBILITY
-- Performing Test __KDE_HAVE_GCC_VISIBILITY - Success
-- Found KDE 4.12 include dir: /usr/include
-- Found KDE 4.12 library dir: /usr/lib
-- Found the KDE4 kconfig_compiler preprocessor: /usr/bin/kconfig_compiler
-- Found automoc4: /usr/bin/automoc4
-- Found Qt-Version 4.8.6 (using /usr/bin/qmake)
-- Found X11: /usr/lib/x86_64-linux-gnu/libX11.so
-- Found KDE 4.12 include dir: /usr/include
-- Found KDE 4.12 library dir: /usr/lib
-- Found the KDE4 kconfig_compiler preprocessor: /usr/bin/kconfig_compiler
-- Found automoc4: /usr/bin/automoc4
CMake Error at /usr/share/kde4/apps/cmake/modules/FindKDE4Internal.cmake:1472 (add_custom_target):
add_custom_target cannot create target "uninstall" because another target
with the same name already exists. The existing target is a custom target
created in source directory
"/home/tommy/Downloads/CurrencyPlasmoid/CurrencyPlasmoid". See
documentation for policy CMP0002 for more details.
Call Stack (most recent call first):
/usr/share/cmake-2.8/Modules/FindKDE4.cmake:95 (find_package)
CurrencyEngine/CMakeLists.txt:7 (find_package)


-- Found Qt-Version 4.8.6 (using /usr/bin/qmake)
-- Found X11: /usr/lib/x86_64-linux-gnu/libX11.so
-- Configuring incomplete, errors occurred!
See also "/home/tommy/Downloads/CurrencyPlasmoid/build/CMakeFiles/CMakeOutput.log".
See also "/home/tommy/Downloads/CurrencyPlasmoid/build/CMakeFiles/CMakeError.log".

/* * * * * * * * * * * * * * * * * * * *
If you want I can send you the error and output logs located in build/CMakeFiles/
*/
- Jan 31 2016
The CMakeLists.txt you mention is below:

# Project Needs a name ofcourse
project(plasma_currency)
set( CMAKE_AUTOMOC ON )
# CMake uses uic in order to generate header files from .ui forms from designer.
set ( CMAKE AUTOUIC ON )
# Auto-generating functions write their headers into the build directory.
# Hence the build directory should be included.
set( CMAKE_INCLUDE_CURRENT_DIR ON )

# Find the required Libaries
find_package(KDE4 REQUIRED)
#find_package(Qt4 COMPONENTS QTCORE QTGUI)
include(KDE4Defaults)

add_definitions (${QT_DEFINITIONS} ${KDE4_DEFINITIONS})
include_directories(
${CMAKE_SOURCE_DIR}
${CMAKE_BINARY_DIR}
${KDE4_INCLUDES}
)

# We add our source code here
set(currency_SRCS plasma-currency.cpp config.cpp)

QT4_WRAP_CPP(qt_H_MOC ui_config.h)
QT4_WRAP_UI(qt_UI_H config.ui)

# Now make sure all files get to the right place

kde4_add_plugin(plasma_applet_currency ${currency_SRCS})
kde4_add_app_icon(currency_SRCS "hi128-apps-currency.png" )
add_library(qt ${qt_UI_H})
target_link_libraries(plasma_applet_currency qt
${KDE4_PLASMA_LIBS} ${KDE4_KDEUI_LIBS})
# Qt4::QtCore Qt4::QtGui)

# install(FILES plasma-applet-currency.desktop
# DESTINATION "~/.kde/share/kde4/services/")

install(TARGETS plasma_applet_currency
DESTINATION ${PLUGIN_INSTALL_DIR})

install(FILES plasma-applet-currency.desktop
DESTINATION ${SERVICES_INSTALL_DIR})
kde4_install_icons( ${ICON_INSTALL_DIR} )

I found no mention of "qt"
Do I need a different CMakeLists.txt?
Thank you! - Jan 31 2016
-- Found Qt-Version 4.8.6 (using /usr/bin/qmake)
-- Found X11: /usr/lib/x86_64-linux-gnu/libX11.so
-- Found KDE 4.12 include dir: /usr/include
-- Found KDE 4.12 library dir: /usr/lib
-- Found the KDE4 kconfig_compiler preprocessor: /usr/bin/kconfig_compiler
-- Found automoc4: /usr/bin/automoc4
-- Found Qt-Version 4.8.6 (using /usr/bin/qmake)
-- Found X11: /usr/lib/x86_64-linux-gnu/libX11.so
-- Found KDE 4.12 include dir: /usr/include
-- Found KDE 4.12 library dir: /usr/lib
-- Found the KDE4 kconfig_compiler preprocessor: /usr/bin/kconfig_compiler
-- Found automoc4: /usr/bin/automoc4
CMake Error at /usr/share/kde4/apps/cmake/modules/FindKDE4Internal.cmake:1472 (add_custom_target):
add_custom_target cannot create target "uninstall" because another target
with the same name already exists. The existing target is a custom target
created in source directory
"~/Downloads/CurrencyPlasmoid/CurrencyPlasmoid". See
documentation for policy CMP0002 for more details.
Call Stack (most recent call first):
/usr/share/cmake-2.8/Modules/FindKDE4.cmake:95 (find_package)
CurrencyEngine/CMakeLists.txt:7 (find_package)


-- Found Qt-Version 4.8.6 (using /usr/bin/qmake)
-- Found X11: /usr/lib/x86_64-linux-gnu/libX11.so
-- Configuring incomplete, errors occurred!
See also "~/Downloads/CurrencyPlasmoid/build/CMakeFiles/CMakeOutput.log".
See also "~/Downloads/CurrencyPlasmoid/build/CMakeFiles/CMakeError.log".

When I entered the line:
cmake -DCMAKE_INSTALL_PREFIX='kde4-config --prefix' ..
I got that message. I can email you the
output and error logs in CMakeFiles if you wish.
Kubuntu 14.04 Trusty, AMD64 8-core, 4GHz. with 512GB SSD
- Jan 30 2016
Sunshine Beach Coast (5320x3603)

Beaches and Oceans 1 comment

Score 50.0%
Mar 01 2016
... a little less contrast in the photos. As it is they look unreal. Two different people, two different ways to view the world.
I can live with that. - Mar 01 2016
Arno River

Wallpaper Other 2 comments

Score 53.3%
Sep 18 2015
True, but that is because I am given sizes to choose from and the photo does not match that particular size. I don't know how to change the selection, so I give the files names that show the true size. - Sep 18 2015
Kfilebox

Network 113 comments

Score 84.1%
Jan 17 2011
It does NOT load the local directory for Dropbox and when I go into Preferences/Account, I have to "move" the directory by selecting ~/Dropbox from the Move file menu.
This happens EVERY time I reboot and I have to restart Dropbox as well.
I don't reboot very often but it is a pain-in-the-a$$. This only started recently after I upgraded to Tardy 14.04. If you have a fix, I would appreciate it.
Thank you! - Sep 08 2014
KOceanSaver

Screensavers 91 comments

Score 76.7%
Oct 19 2013
I now using Kubuntu Maverick 10.10, kernel 2.6.35-30
qt4-3.1-amd on AMD64 and for some reason the screen now goes blank and uses up 100% of the cpu. I have dual cpus so one is always at 100% and the computer is almost completely useless until I close KOceanSaver.
What could be causing that?
Will upgrading to Natty 11.04 change that? - Jul 23 2011
I managed to qmake the source code, however, the command: "sudo make install" ended with this:
g++ -Wl,--no-undefined -o KOceanSaver ocean.o guidancesystem.o kocean.o wavemap.o seacreature.o moc_ocean.o moc_kocean.o qrc_data.o -L/usr/lib -L/usr/X11R6/lib -lkscreensaver -lQtOpenGL -lQtGui -lQtCore -lGLU -lGL -lpthread
/usr/bin/ld: cannot find -lGL
collect2: ld returned 1 exit status
make: *** [KOceanSaver] Error 1

Is there a solution for this so I can finish the installation?
Thank you! - Apr 12 2009
iQfirewall

Network 3 comments

by jacum
Score 50.0%
May 03 2010
I have been running this firewall for a while now and am very happy with it. The only catch is the fact that it is not in the repositories and there is no .deb file. I put this program on my laptop running kubuntu LL 10.04 and it installed fine. I lost my hard drive on my desktop and am now unable to load it onto new setup. I tried the original install that worked for my laptop, cmake and rubbing two sticks together. Nothing helped.
If anyone has any ideas no matter how far fetched, please let me know.

Results:
Ok
3b. Compiling the sources...
/usr/bin/uic-qt4 src/iqfire.ui -o ui_iqfire.h
/usr/bin/uic-qt4 src/iqfrule_adder.ui -o ui_iqfrule_adder.h
/usr/bin/uic-qt4 src/config.ui -o ui_config.h
g++ -c -pipe -g -Wall -W -D_REENTRANT -DENABLE_RULENAME -DQT_GUI_LIB -DQT_NETWORK_LIB -DQT_CORE_LIB -DQT_SHARED -I/usr/share/qt4/mkspecs/linux-g++ -I. -I/usr/include/qt4/QtCore -I/usr/include/qt4/QtNetwork -I/usr/include/qt4/QtGui -I/usr/include/qt4 -I/home/kde-devel/kde/include -I/usr/include -I. -Isrc -I../ipfi/src/includes -I/usr/include/qwt5 -I../ipfi/src/includes/kincludes -I/home/kde-devel/kde/include/KDE/ -I/usr/kde/svn/include -I/usr/kde/svn/include/KDE -I/usr/kde/4.0/include/KDE/ -I/usr/kde/4.0/include -I/usr/kde/4.1/include/KDE/ -I/usr/kde/4.1/include -I/usr/kde/4.2/include/KDE/ -I/usr/kde/4.2/include -I/usr/local/qwt-5.2.0/include -I/usr/local/qwt-5.1.1/include -Inatural_language -Isrc/iqf_natural_language -Inatural_language/includes -I.. -I. -Isrc -Isrc/stats -I../ipfi/src/includes -I/usr/include/qwt-qt4 -I../ipfi/src/includes/kincludes -I/usr/lib/kde4/include/KDE/ -I/usr/local/qwt-5.0.2/include -Inatural_language/includes -Isrc/kernel_tables_widgets -I/usr/include/KDE -I/usr/include/qwt-qt4 -Imoc -I. -o obj/iqfire.o src/iqfire.cpp
In file included from ../ipfi/src/includes/ipfire_structs.h:20,
from src/iqf_rulematch_set.h:8,
from src/iqf_notified_packets.h:9,
from ./ui_iqfire.h:32,
from src/iqfire.h:11,
from src/iqfire.cpp:1:
../common/defs/ipfi_structures.h:10:2: warning: #warning ("\033[1;31mKERNEL MODE includes linux/tcp.h, user includes netinet/tcp.h\033[0m")
In file included from src/iqf_validators.h:5,
from ./ui_iqfire.h:33,
from src/iqfire.h:11,
from src/iqfire.cpp:1:
src/iqfwidgets.h:22:29: error: qwt_legend_item.h: No such file or directory
In file included from src/stats/eplotlight.h:6,
from src/stats/eplotlight_marker.h:24,
from src/stats/kernel_stats_plot.h:25,
from src/stats/kernel_tables_stats.h:27,
from src/iqfire.cpp:22:
src/stats/eplotlight_base.h:25:22: error: qwt_plot.h: No such file or directory
src/stats/eplotlight_base.h:26:28: error: qwt_plot_curve.h: No such file or directory
src/stats/eplotlight_base.h:27:27: error: qwt_plot_grid.h: No such file or directory
src/stats/eplotlight_base.h:28:29: error: qwt_plot_canvas.h: No such file or directory
src/stats/eplotlight_base.h:29:29: error: qwt_plot_layout.h: No such file or directory
src/stats/eplotlight_base.h:30:30: error: qwt_scale_widget.h: No such file or directory
src/stats/eplotlight_base.h:31:28: error: qwt_scale_draw.h: No such file or directory
In file included from src/stats/eplotcurve.h:25,
from src/stats/eplotlight.h:7,
from src/stats/eplotlight_marker.h:24,
from src/stats/kernel_stats_plot.h:25,
from src/stats/kernel_tables_stats.h:27,
from src/iqfire.cpp:22:
src/stats/ecurvedata.h:25:23: error: qwt_array.h: No such file or directory
In file included from src/stats/kernel_stats_plot.h:25,
from src/stats/kernel_tables_stats.h:27,
from src/iqfire.cpp:22:
src/stats/eplotlight_marker.h:25:27: error: qwt_plot_item.h: No such file or directory
In file included from src/iqf_validators.h:5,
from ./ui_iqfire.h:33,
from src/iqfire.h:11,
from src/iqfire.cpp:1:
src/iqfwidgets.h:315: error: expected class-name before ‘{’ token
src/iqfwidgets.h: In member function ‘void IQFLegendItem::wheelEvent(QWheelEvent*)’:
src/iqfwidgets.h:339: error: cannot call member function ‘virtual void QWidget::wheelEvent(QWheelEvent*)’ without object
In file included from src/stats/eplotlight.h:6,
from src/stats/eplotlight_marker.h:24,
from src/stats/kernel_stats_plot.h:25,
from src/stats/kernel_tables_stats.h:27,
from src/iqfire.cpp:22:
src/stats/eplotlight_base.h: At global scope:
src/stats/eplotlight_base.h:37: error: expected class-name before ‘{’ token
src/stats/eplotlight_base.h:41: error: ‘QwtText’ does not name a type
src/stats/eplotlight_base.h:76: error: expected class-name before ‘{’ token
src/stats/eplotlight_base.h:103: error: ISO C++ forbids declaration of ‘QwtText’ with no type
src/stats/eplotlight_base.h:103: error: expected ‘,’ or ‘...’ before ‘&’ token
src/stats/eplotlight_base.h:132: error: ‘QwtPlotCurve::CurveStyle’ has not been declared
In file included from src/stats/eplotlight.h:6,
from src/stats/eplotlight_marker.h:24,
from src/stats/kernel_stats_plot.h:25,
from src/stats/kernel_tables_stats.h:27,
from src/iqfire.cpp:22:
src/stats/eplotlight_base.h:290: error: ‘CurveStyle’ in class ‘QwtPlotCurve’ does not name a type
In file included from src/stats/eplotlight.h:6,
from src/stats/eplotlight_marker.h:24,
from src/stats/kernel_stats_plot.h:25,
from src/stats/kernel_tables_stats.h:27,
from src/iqfire.cpp:22:
src/stats/eplotlight_base.h: In member function ‘void EPlotLightBase::setCurvesStyleAsInt(int)’:
src/stats/eplotlight_base.h:133: error: incomplete type ‘QwtPlotCurve’ used in nested name specifier
src/stats/eplotlight_base.h: At global scope:
src/stats/eplotlight_base.h:133: warning: unused parameter ‘cs’
src/stats/eplotlight_base.h: In member function ‘int EPlotLightBase::curvesStyle()’:
src/stats/eplotlight_base.h:134: error: ‘d_curvesStyle’ was not declared in this scope
In file included from src/stats/eplotcurve.h:25,
from src/stats/eplotlight.h:7,
from src/stats/eplotlight_marker.h:24,
from src/stats/kernel_stats_plot.h:25,
from src/stats/kernel_tables_stats.h:27,
from src/iqfire.cpp:22:
src/stats/ecurvedata.h: At global scope:
src/stats/ecurvedata.h:44: error: ISO C++ forbids declaration of ‘QwtArray’ with no type
src/stats/ecurvedata.h:44: error: expected ‘;’ before ‘<’ token
src/stats/ecurvedata.h:45: error: ISO C++ forbids declaration of ‘QwtArray’ with no type
src/stats/ecurvedata.h:45: error: expected ‘;’ before ‘<’ token
In file included from src/stats/eplotlight.h:7,
from src/stats/eplotlight_marker.h:24,
from src/stats/kernel_stats_plot.h:25,
from src/stats/kernel_tables_stats.h:27,
from src/iqfire.cpp:22:
src/stats/eplotcurve.h:28: error: invalid use of incomplete type ‘struct QwtPlotCurve’
src/iqfwidgets.h:25: error: forward declaration of ‘struct QwtPlotCurve’
src/stats/eplotcurve.h:38: error: ISO C++ forbids declaration of ‘QwtText’ with no type
src/stats/eplotcurve.h:38: error: expected ‘,’ or ‘...’ before ‘&’ token
src/stats/eplotcurve.h:57: error: ISO C++ forbids declaration of ‘QwtArray’ with no type
src/stats/eplotcurve.h:57: error: expected ‘,’ or ‘...’ before ‘<’ token
In file included from src/stats/eplotlight_marker.h:24,
from src/stats/kernel_stats_plot.h:25,
from src/stats/kernel_tables_stats.h:27,
from src/iqfire.cpp:22:
src/stats/eplotlight.h:56: error: ISO C++ forbids declaration of ‘QwtText’ with no type
src/stats/eplotlight.h:56: error: expected ‘,’ or ‘...’ before ‘&’ token
src/stats/eplotlight.h:78: error: ‘QwtPlotCurve::CurveStyle’ has not been declared
src/stats/eplotlight.h: In member function ‘bool EPlotLight::yAutoscale()’:
src/stats/eplotlight.h:95: error: ‘QwtPlot’ has not been declared
src/stats/eplotlight.h:95: error: ‘axisAutoScale’ was not declared in this scope
In file included from src/stats/kernel_stats_plot.h:25,
from src/stats/kernel_tables_stats.h:27,
from src/iqfire.cpp:22:
src/stats/eplotlight_marker.h: At global scope:
src/stats/eplotlight_marker.h:34: error: expected class-name before ‘{’ token
src/stats/eplotlight_marker.h:37: error: ISO C++ forbids declaration of ‘QwtText’ with no type
src/stats/eplotlight_marker.h:37: error: expected ‘,’ or ‘...’ before ‘&’ token
src/stats/eplotlight_marker.h:38: error: ISO C++ forbids declaration of ‘QwtScaleMap’ with no type
src/stats/eplotlight_marker.h:38: error: expected ‘,’ or ‘...’ before ‘&’ token
src/stats/eplotlight_marker.h:40: error: ‘QwtDoublePoint’ does not name a type
src/stats/eplotlight_marker.h: In constructor ‘Arrow::Arrow(int)’:
src/stats/eplotlight_marker.h:37: error: class ‘Arrow’ does not have any field named ‘QwtPlotItem’
src/stats/eplotlight_marker.h:37: error: ‘title’ was not declared in this scope
src/stats/eplotlight_marker.h: At global scope:
src/stats/eplotlight_marker.h:37: warning: unused parameter ‘QwtText’
src/stats/eplotlight_marker.h:69: error: ISO C++ forbids declaration of ‘QwtText’ with no type
src/stats/eplotlight_marker.h:69: error: expected ‘,’ or ‘...’ before ‘&’ token
src/stats/eplotlight_marker.h:77: error: ISO C++ forbids declaration of ‘QwtText’ with no type
src/stats/eplotlight_marker.h:77: error: expected ‘,’ or ‘...’ before ‘&’ token
src/stats/eplotlight_marker.h:80: error: ISO C++ forbids declaration of ‘QwtPolygon’ with no type
src/stats/eplotlight_marker.h:80: error: expected ‘,’ or ‘...’ before ‘&’ token
src/stats/eplotlight_marker.h:84: error: ISO C++ forbids declaration of ‘QwtDoubleRect’ with no type
src/stats/eplotlight_marker.h:84: error: expected ‘,’ or ‘...’ before ‘&’ token
In file included from src/stats/kernel_tables_stats.h:27,
from src/iqfire.cpp:22:
src/stats/kernel_stats_plot.h:31: error: ISO C++ forbids declaration of ‘QwtText’ with no type
src/stats/kernel_stats_plot.h:31: error: expected ‘,’ or ‘...’ before ‘&’ token
src/iqfire.cpp: In constructor ‘IQFIREmainwin::IQFIREmainwin(QWidget*, int, char**)’:
src/iqfire.cpp:169: warning: unused variable ‘stateTW’
src/iqfire.cpp:170: warning: unused variable ‘snatTW’
src/iqfire.cpp:171: warning: unused variable ‘dnatTW’
src/iqfire.cpp:172: warning: unused variable ‘ktablesStats’
make: *** [obj/iqfire.o] Error 1

Failed :(

/* ***************************** */
uname:
Linux kubuntu 2.6.32-25-generic #44-Ubuntu SMP Fri Sep 17 20:05:27 UTC 2010 x86_64 GNU/Linux
8G RAM
AMD Athlon(tm) 64 X2 Dual Core Processor 6400+

- Oct 11 2010
Mountoid

Plasma 4 Widgets 77 comments

Score 74.0%
Dec 24 2010
I have the "libqt4-phonon-dev" package installed. What else is needed?
Thank you! - Nov 27 2009
Results: (the lines may wrap)
tommy@kubuntu:~/Downloads/mountoid/build$ cmake -DCMAKE_INSTALL_PREFIX=$KDEDIRS ..
-- The C compiler identification is GNU
-- The CXX compiler identification is GNU
-- Check for working C compiler: /usr/bin/gcc
-- Check for working C compiler: /usr/bin/gcc -- works
-- Detecting C compiler ABI info
-- Detecting C compiler ABI info - done
-- Check for working CXX compiler: /usr/bin/c++
-- Check for working CXX compiler: /usr/bin/c++ -- works
-- Detecting CXX compiler ABI info
-- Detecting CXX compiler ABI info - done
-- Looking for Q_WS_X11
-- Looking for Q_WS_X11 - found
-- Looking for Q_WS_WIN
-- Looking for Q_WS_WIN - not found.
-- Looking for Q_WS_QWS
-- Looking for Q_WS_QWS - not found.
-- Looking for Q_WS_MAC
-- Looking for Q_WS_MAC - not found.
-- Found Qt-Version 4.5.2 (using /usr/bin/qmake)
-- Looking for XOpenDisplay in /usr/lib/libX11.so;/usr/lib/libXext.so;/usr/lib/libXft.so;/usr/lib/libXau.so;/usr/lib/libXdmcp.so
-- Looking for XOpenDisplay in /usr/lib/libX11.so;/usr/lib/libXext.so;/usr/lib/libXft.so;/usr/lib/libXau.so;/usr/lib/libXdmcp.so - found
-- Looking for gethostbyname
-- Looking for gethostbyname - found
-- Looking for connect
-- Looking for connect - found
-- Looking for remove
-- Looking for remove - found
-- Looking for shmat
-- Looking for shmat - found
-- Looking for IceConnectionNumber in ICE
-- Looking for IceConnectionNumber in ICE - found
-- Found X11: /usr/lib/libX11.so
-- Looking for include files CMAKE_HAVE_PTHREAD_H
-- Looking for include files CMAKE_HAVE_PTHREAD_H - found
-- Looking for pthread_create in pthreads
-- Looking for pthread_create in pthreads - not found
-- Looking for pthread_create in pthread
-- Looking for pthread_create in pthread - found
-- Found Threads: TRUE
-- Found Automoc4: /usr/bin/automoc4
-- Found Perl: /usr/bin/perl
-- Phonon includes NOT found!
CMake Error at /usr/share/kde4/apps/cmake/modules/FindPhonon.cmake:63 (message):
Phonon library or includes NOT found!
Call Stack (most recent call first):
/usr/share/kde4/apps/cmake/modules/FindKDE4Internal.cmake:559 (find_package)
/usr/share/cmake-2.6/Modules/FindKDE4.cmake:81 (FIND_PACKAGE)
CMakeLists.txt:5 (find_package)


-- Configuring incomplete, errors occurred!

I am using kubuntu Karmic Koala with KDE 4.3.3 on an AMD64.
Thank you! - Nov 27 2009
KOceanSaver

Screensavers
by jboss1995

Score 76.7%
Apr 10 2015
iQfirewall

Network
by jacum

Score 50.0%
Oct 11 2010