Image 01
profile-image

danywv

Daniel Andrei Timisoara, Romania
Wallpaper Other
test
RPM Package Maker

System Software 27 comments

by bico
Score 50.0%
Nov 20 2009
Followed trisz's advice and copied kde headers into the directory..it passed the previous error but:


g++ -c -pipe -Wall -W -O2 -g -pipe -Wall -Wp,-D_FORTIFY_SOURCE=2 -fexceptions -fstack-protector --param=ssp-buffer-size=4 -m32 -march=i386 -mtune=generic -fasynchronous-unwind-tables -DQT_NO_DEBUG -DQT_SHARED -DQT_THREAD_SUPPORT -I/usr/lib/qt-3.3/mkspecs/default -I. -I/usr/include -I/usr/include/kio -I/usr/lib/qt-3.3/include -I.ui/ -I. -I.moc/ -o .obj/main.o main.cpp
/usr/lib/qt-3.3/bin/uic main_form.ui -i main_form.h -o .ui/main_form.cpp
g++ -c -pipe -Wall -W -O2 -g -pipe -Wall -Wp,-D_FORTIFY_SOURCE=2 -fexceptions -fstack-protector --param=ssp-buffer-size=4 -m32 -march=i386 -mtune=generic -fasynchronous-unwind-tables -DQT_NO_DEBUG -DQT_SHARED -DQT_THREAD_SUPPORT -I/usr/lib/qt-3.3/mkspecs/default -I. -I/usr/include -I/usr/include/kio -I/usr/lib/qt-3.3/include -I.ui/ -I. -I.moc/ -o .obj/main_form.o .ui/main_form.cpp
In file included from .ui/main_form.cpp:31:
.ui/../main_form.ui.h:37:17: error: job.h: No such file or directory
/usr/lib/qt-3.3/include/qtooltip.h:86: warning: ‘class QToolTip’ has virtual functions but non-virtual destructor
/usr/lib/qt-3.3/include/qnetworkprotocol.h:58: warning: ‘class QNetworkProtocolFactoryBase’ has virtual functions but non-virtual destructor
/usr/lib/qt-3.3/include/qfiledialog.h:78: warning: ‘class QFilePreview’ has virtual functions but non-virtual destructor
.ui/../main_form.ui.h:60: warning: unused parameter ‘unused’
make: *** [.obj/main_form.o] Error 1 - Mar 23 2006
[daniel@localhost rpmpm-0.9]$ ./configure && make
Checking for KDE... /usr
Checking for qmake... /usr/bin/qmake
Creating project file... ok
Creating Makefile... ok

Good - your configure finished. Start make now.

/usr/lib/qt-3.3/bin/uic main_form.ui -o .ui/main_form.h
/usr/lib/qt-3.3/bin/uic output.ui -o .ui/output.h
/usr/lib/qt-3.3/bin/uic prefix.ui -o .ui/prefix.h
/usr/lib/qt-3.3/bin/uic specedit.ui -o .ui/specedit.h
g++ -c -pipe -Wall -W -O2 -g -pipe -Wall -Wp,-D_FORTIFY_SOURCE=2 -fexceptions -fstack-protector --param=ssp-buffer-size=4 -m32 -march=i386 -mtune=generic -fasynchronous-unwind-tables -DQT_NO_DEBUG -DQT_SHARED -DQT_THREAD_SUPPORT -I/usr/lib/qt-3.3/mkspecs/default -I. -I/usr/include -I/usr/include/kio -I/usr/lib/qt-3.3/include -I.ui/ -I. -I.moc/ -o .obj/main.o main.cpp
In file included from main.cpp:2:
.ui/main_form.h:15:22: error: ktempdir.h: No such file or directory
.ui/main_form.h:16:22: error: kprocess.h: No such file or directory
.ui/main_form.h:58: error: ISO C++ forbids declaration of ‘KProcess’ with no type
.ui/main_form.h:58: error: expected ‘;’ before ‘*’ token
.ui/main_form.h:60: error: ISO C++ forbids declaration of ‘KTempDir’ with no type
.ui/main_form.h:60: error: expected ‘;’ before ‘*’ token
.ui/main_form.h:61: error: ISO C++ forbids declaration of ‘KProcess’ with no type
.ui/main_form.h:61: error: expected ‘;’ before ‘*’ token
.ui/main_form.h:62: error: ISO C++ forbids declaration of ‘KProcess’ with no type
.ui/main_form.h:62: error: expected ‘;’ before ‘*’ token
.ui/main_form.h:63: error: ISO C++ forbids declaration of ‘KProcess’ with no type
.ui/main_form.h:63: error: expected ‘;’ before ‘*’ token
.ui/main_form.h:64: error: ISO C++ forbids declaration of ‘KProcess’ with no type
.ui/main_form.h:64: error: expected ‘;’ before ‘*’ token
.ui/main_form.h:71: error: ‘KProcess’ has not been declared
.ui/main_form.h:80: error: ‘KProcess’ has not been declared
.ui/main_form.h:92: error: ‘KProcess’ has not been declared
.ui/main_form.h:93: error: ‘KProcess’ has not been declared
make: *** [.obj/main.o] Error 1 - Mar 23 2006