Image 01
profile-image

GDigger24

Jonathan Hooverman
Phototonic

Graphic Apps by oferk 4 comments

Please ensure, that you have installed the package libexiv2-devel or libexiv2-dev. - Aug 10 2014
GmailSniffer

Email by Katropine 11 comments

I found out, that I am lost with googles memory, which I will have to clean up first.

gmailsniffer displays the XML-file correctly. Sorry for the noise. - Jun 16 2013
GmailSniffer

Email by Katropine 11 comments

Today in the morning I have compiled git-version 0cd7d39 and this version is running since that time. So, the whole day gmailsniffer tells me, that I have 20 unread mails in my account, when I am hovering over the systray icon.

When I select "Show sniffer" the windows displays 20 messages, always the first one is marked with a red envelope, the others are marked with a blue envelope.

When I check the emails with claws-mail, I have 12 unread mails, if I go to gmails web-inbox I find 9 unread conversations.
Why will gmailsniffer display 20 unread mails? - Jun 16 2013
GmailSniffer

Email by Katropine 11 comments

As I saw, you are retrieving the information about new mails via https (https://mail.google.com/mail/feed/atom/unread).

I will have to enter the user credentials (user anme + password) once in the settings dialog. Where are the they stored?

If I select "show sniffer" a notification area will be opened, that displays all unread mails. Clicking on an entry will open the default browser and I will have to enter my user credentials again. Will it be possible to parse them from gmail sniffer to the browser to access gmails inbox directly? - Jun 16 2013
GmailSniffer

Email by Katropine 11 comments

As I saw, you are retrieving the information about new mails via https (https://mail.google.com/mail/feed/atom/unread).

I will have to enter the user credentials (user anme + password) once in the settings dialog. Where are the they stored?

If I select "show sniffer" a notification area will be opened, that displays all unread mails. Clicking on an entry will open the default browser and I will have to enter my user credentials again. Will it be possible to parse them from gmail sniffer to the browser to access gmails inbox directly? - Jun 16 2013
GmailSniffer

Email by Katropine 11 comments

It works now, thank you! - Jun 16 2013
GmailSniffer

Email by Katropine 11 comments

Will it be possible to check subfolders/ labels as well for unread mails? - Jun 15 2013
easymount

System Software by sadaszewski 4 comments

I am on openSuSE 12.1 and udev is managed by the OS. So, I do not know, if udev could have been restarted... - Apr 08 2013
easymount

System Software by sadaszewski 4 comments

Great piece of software!

Do you have an idea, why the entries for sdd are appearing twice in the list?

http://img809.imageshack.us/img809/357/screenshote9634390.png - Apr 08 2013
QNetStatView

Network by admsasha 42 comments

Compilation failed for me, so I thought, some missing files were the reason. But I had to install libnet-devel and libpcap-devel. Now I succeeded. Great program, thank you! - Mar 18 2013
QNetStatView

Network by admsasha 42 comments

It seems, that the sources for 1.1.1 are broken (filesize is 38,5 KB, filesize previous version is 561,5 KB). Thanks - Mar 17 2013
NewBreeze

System Software by marcusbritanicus 96 comments

For openSuSE you will need the packages file and file-devel - Oct 05 2012
NewBreeze

System Software by marcusbritanicus 96 comments

I did this:

- Extract the tar-file
- Go to directory /NewBreeze-stable
- Open terminal in this directory
- Run qmake at the prompt
- When this is finished, type make - Oct 04 2012
NewBreeze

System Software by marcusbritanicus 96 comments

While compiling newbreeze, I get this error:

g++ -c -pipe -O2 -D_REENTRANT -w -DQT_WEBKIT -DQT_NO_DEBUG -DQT_GUI_LIB -DQT_CORE_LIB -DQT_SHARED -I/usr/share/qt4/mkspecs/default -I. -I/usr/include/QtCore -I/usr/include/QtGui -I/usr/include -I. -IPlugins/FolderFlash -IPlugins/WordView -IPlugins/ImagePeek -IPlugins/SidePanel -IPlugins/TitleBar -IPlugins/ToolBar -IPlugins/StatusBar -IPlugins/PropsView -IPlugins/PasteDialog -IPlugins/ConfigParser -IPlugins/CustomPeek -Ibuild/moc -o build/objs/NBTools.o NBTools.cpp
NBTools.cpp:12:19: fatal error: magic.h: No such file or directory

Which devel-package am I missing? - Oct 04 2012
X2

Text Editors by njal 103 comments

Is it possible, that you have switched some functions to use/ support gtk3?

I have found this on the gtk developers page:

Warning
gtk_combo_box_get_active_text has been deprecated since version 2.24 and should not be used in newly-written code. If you used this with a GtkComboBox constructed with gtk_combo_box_new_text() then you should now use GtkComboBoxText and gtk_combo_box_text_get_active_text() instead. Or if you used this with a GtkComboBoxEntry then you should now use GtkComboBox with "has-entry" as TRUE and use gtk_entry_get_text (GTK_ENTRY (gtk_bin_get_child (GTK_BIN (combobox))). - Oct 22 2011
X2

Text Editors by njal 103 comments

Is it possible, that you have switched some functions to use/ support gtk3?

I have found this on the gtk developers page:

Warning
gtk_combo_box_get_active_text has been deprecated since version 2.24 and should not be used in newly-written code. If you used this with a GtkComboBox constructed with gtk_combo_box_new_text() then you should now use GtkComboBoxText and gtk_combo_box_text_get_active_text() instead. Or if you used this with a GtkComboBoxEntry then you should now use GtkComboBox with "has-entry" as TRUE and use gtk_entry_get_text (GTK_ENTRY (gtk_bin_get_child (GTK_BIN (combobox))). - Oct 22 2011
X2

Text Editors by njal 103 comments

Is it possible, that you have switched some functions to use/ support gtk3?

I have found this on the gtk developers page:

Warning
gtk_combo_box_get_active_text has been deprecated since version 2.24 and should not be used in newly-written code. If you used this with a GtkComboBox constructed with gtk_combo_box_new_text() then you should now use GtkComboBoxText and gtk_combo_box_text_get_active_text() instead. Or if you used this with a GtkComboBoxEntry then you should now use GtkComboBox with "has-entry" as TRUE and use gtk_entry_get_text (GTK_ENTRY (gtk_bin_get_child (GTK_BIN (combobox))). - Oct 22 2011
X2

Text Editors by njal 103 comments

Hello,
starting with version 1.0.8 x2 does not compile on my system anymore. This is the error message:


make -C src all
make[1]: Entering directory `/usr/src/packages/SOURCES/x2-1.0.8/src'
gcc -Wall -g -O0 -o x2 main.c `pkg-config --libs --cflags vte gtksourceview-2.0`
In file included from main.c:18:0:
callbacks.c: In function ‘New’:
callbacks.c:37:2: warning: implicit declaration of function ‘gtk_combo_box_text_new’
callbacks.c:37:19: warning: assignment makes pointer from integer without a cast
callbacks.c:133:9: warning: ‘vte_terminal_fork_command’ is deprecated (declared at /usr/include/vte-0.0/vte/vtedeprecated.h:82)
In file included from main.c:18:0:
callbacks.c: In function ‘Template’:
callbacks.c:375:15: warning: initialization discards qualifiers from pointer target type
In file included from main.c:18:0:
callbacks.c: In function ‘drag_data_received_handler’:
callbacks.c:898:16: warning: pointer targets in initialization differ in signedness
callbacks.c: In function ‘Populate_CMB’:
callbacks.c:1012:2: warning: passing argument 1 of ‘gtk_combo_box_get_model’ from incompatible pointer type
/usr/include/gtk-2.0/gtk/gtkcombobox.h:109:15: note: expected ‘struct GtkComboBox *’ but argument is of type ‘struct GtkWidget *’
callbacks.c:1017:16: warning: initialization discards qualifiers from pointer target type
callbacks.c:1020:4: warning: implicit declaration of function ‘gtk_combo_box_text_append_text’
callbacks.c:1020:4: warning: implicit declaration of function ‘GTK_COMBO_BOX_TEXT’
/tmp/ccD4IPu6.o: In function `New':
/usr/src/packages/SOURCES/x2-1.0.8/src/callbacks.c:37: undefined reference to `gtk_combo_box_text_new'
/tmp/ccD4IPu6.o: In function `Populate_CMB':
/usr/src/packages/SOURCES/x2-1.0.8/src/callbacks.c:1020: undefined reference to `GTK_COMBO_BOX_TEXT'
/usr/src/packages/SOURCES/x2-1.0.8/src/callbacks.c:1020: undefined reference to `gtk_combo_box_text_append_text'
collect2: ld returned 1 exit status
make[1]: *** [x2] Error 1
make[1]: Leaving directory `/usr/src/packages/SOURCES/x2-1.0.8/src'
make: *** [all] Error 2
- Oct 19 2011
X2

Text Editors by njal 103 comments

Please do not forget to adjust your BIOS clock. It still runs too fast... - Oct 01 2011
X2

Text Editors by njal 103 comments

Sorry, I forgot to say, that these outputs are just warnings. Compilation ends successfully and I am able to start and run X2, althoug I am gettings these warnings:

PC@linux-3l36:/testing/share/programs/gtk/x2/x2-1.0.1/src> ./x2

(x2:9847): Pango-CRITICAL **: pango_font_description_from_string: assertion `str != NULL' failed

(x2:9847): Gtk-CRITICAL **: IA__gtk_font_button_set_font_name: assertion `fontname != NULL' failed

(x2:9847): Gtk-CRITICAL **: IA__gtk_font_button_set_font_name: assertion `fontname != NULL' failed
X2 online

What I really like is to have text editor and terminal in one. Thank for this! - Oct 01 2011
X2

Text Editors by njal 103 comments

I did. Now. this follows:

make -C src all
make[1]: Entering directory `/testing/share/programs/gtk/x2/x2-1.0.1/src'
gcc -Wall -g -O0 -o x2 main.c `pkg-config --libs --cflags vte gtksourceview-2.0`
In file included from main.c:16:0:
callbacks.c: In function ‘New’:
callbacks.c:119:9: warning: ‘vte_terminal_fork_command’ is deprecated (declared at /usr/include/vte-0.0/vte/vtedeprecated.h:82)
In file included from main.c:16:0:
callbacks.c: In function ‘drag_data_received_handler’:
callbacks.c:861:16: warning: pointer targets in initialization differ in signedness
make[1]: Leaving directory `/testing/share/programs/gtk/x2/x2-1.0.1/src'

I have installed
vte-devel-0.26.2-2.1.i586
libvte9-0.26.2-2.1.i586
vte-lang-0.26.2-2.1.noarch

- Oct 01 2011
X2

Text Editors by njal 103 comments

Tried updated version 1.0.2., invoking <make> lead to an endless loop

./config.status Makefile
config.status: creating Makefile
make: Warning: File `Makefile.in' has modification time 6e+04 s in the future
./config.status --recheck
running CONFIG_SHELL=/bin/sh /bin/sh ./configure --no-create --no-recursion
checking for gcc... gcc

I am on openSuSE 11.3 32Bit
- Oct 01 2011
X2

Text Editors by njal 103 comments

Tried updated version 1.0.2., invoking <make> lead to an endless loop

./config.status Makefile
config.status: creating Makefile
make: Warning: File `Makefile.in' has modification time 6e+04 s in the future
./config.status --recheck
running CONFIG_SHELL=/bin/sh /bin/sh ./configure --no-create --no-recursion
checking for gcc... gcc

I am on openSuSE 11.3 32Bit
- Oct 01 2011
X2

Text Editors by njal 103 comments

I have just tried the latest version 1.0.1. Invoking <configure> passes without errors, make stops with

make -C src all
make[1]: Entering directory `/testing/share/programs/gtk/x2/x2-1.0.1/src'
gcc -Wall -g -O0 -o x2 main.c `pkg-config --libs --cflags vte gtksourceview-2.0`
Package vte was not found in the pkg-config search path.
Perhaps you should add the directory containing `vte.pc'
to the PKG_CONFIG_PATH environment variable
No package 'vte' found - Sep 30 2011
WebRender

Browser by anandbose99k 16 comments

It should be
- Do a right click on http://webrender.99k.org

instead of

- Do a right click on http://qt-apps.org/content/show.php/WebRender?content=140450

Thanks. - Jun 23 2011
WebRender

Browser by anandbose99k 16 comments

Hello,

thank for updating webrender!

How do I open a link in website in a new tab?
Example:
- Open this link http://qt-apps.org/content/show.php/WebRender?content=140450
- Do a right click on http://qt-apps.org/content/show.php/WebRender?content=140450
- webrender offers "Open Link" and "Open in New Window"
- "Open Link" supposed to open link in same tab
- "Open in New Windows" supposed to open link in new window

Currently both options even do not work for me, nothing happens when clicking on these commands

In a terminal window I see following messages:

Loading finished with error
Loading finished with error
** (<unknown>:16126): DEBUG: NP_Initialize
** (<unknown>:16126): DEBUG: NP_Initialize succeeded
** (npviewer.bin:16157): DEBUG: NP_Initialize
** (npviewer.bin:16157): DEBUG: NP_Initialize succeeded
** (npviewer.bin:16157): DEBUG: NP_Shutdown
java version "1.6.0_20"
OpenJDK Runtime Environment (IcedTea6 1.9.7) (suse-1.2.1-i386)
OpenJDK Client VM (build 19.0-b09, mixed mode)
** (npviewer.bin:16184): DEBUG: NP_Initialize
** (npviewer.bin:16184): DEBUG: NP_Initialize succeeded
** (<unknown>:16126): DEBUG: NP_Initialize
** (<unknown>:16126): DEBUG: NP_Initialize succeeded
*** NSPlugin Wrapper *** WARNING:(/usr/src/packages/BUILD/nspluginwrapper-1.3.0/src/npw-wrapper.c:3160):invoke_NP_Initialize: assertion failed: (rpc_method_invoke_possible(g_rpc_connection))
*** NSPlugin Wrapper *** WARNING:(/usr/src/packages/BUILD/nspluginwrapper-1.3.0/src/npw-wrapper.c:3160):invoke_NP_Initialize: assertion failed: (rpc_method_invoke_possible(g_rpc_connection))
ERROR: Invalid browser function table. Some functionality may be restricted.
** (npviewer.bin:16251): DEBUG: NP_Initialize
** (npviewer.bin:16251): DEBUG: NP_Initialize succeeded
java version "1.6.0_20"
OpenJDK Runtime Environment (IcedTea6 1.9.7) (suse-1.2.1-i386)
OpenJDK Client VM (build 19.0-b09, mixed mode)
** (npviewer.bin:16277): DEBUG: NP_Initialize
** (npviewer.bin:16277): DEBUG: NP_Initialize succeeded
** (<unknown>:16126): DEBUG: NP_Initialize
** (<unknown>:16126): DEBUG: NP_Initialize succeeded
** (<unknown>:16126): DEBUG: NP_Initialize
** (<unknown>:16126): DEBUG: NP_Initialize succeeded

The directory /usr/src/packages/BUILD/nspluginwrapper-1.3.0/src/ does not exist on my computer.

I am using qt4-4.7.3


Forgot to ask how do I close a tab? - Jun 23 2011
scOpe

System Software by fr33mind 28 comments

Now I am able to successfully compile scope and going to play with scope. Thank you.

BTW my qt version is 4.7.2.

- Apr 21 2011
scOpe

System Software by fr33mind 28 comments

I would really like to try scope but make fails with this error message:

g++ -c -pipe -O2 -Wall -W -D_REENTRANT -DQT_NO_DEBUG -DQT_DBUS_LIB -DQT_GUI_LIB -DQT_CORE_LIB -DQT_SHARED -I/usr/share/qt4/mkspecs/default -I. -I/usr/include/QtCore -I/usr/include/QtGui -I/usr/include/QtDBus -I/usr/include -I. -Isource -Isource/dialogs -Isource/adaptors -Isource/right_panel -I. -I. -o folder_size.o source/dialogs/folder_size.cpp
g++ -c -pipe -O2 -Wall -W -D_REENTRANT -DQT_NO_DEBUG -DQT_DBUS_LIB -DQT_GUI_LIB -DQT_CORE_LIB -DQT_SHARED -I/usr/share/qt4/mkspecs/default -I. -I/usr/include/QtCore -I/usr/include/QtGui -I/usr/include/QtDBus -I/usr/include -I. -Isource -Isource/dialogs -Isource/adaptors -Isource/right_panel -I. -I. -o scopeadaptor.o source/adaptors/scopeadaptor.cpp
g++ -c -pipe -O2 -Wall -W -D_REENTRANT -DQT_NO_DEBUG -DQT_DBUS_LIB -DQT_GUI_LIB -DQT_CORE_LIB -DQT_SHARED -I/usr/share/qt4/mkspecs/default -I. -I/usr/include/QtCore -I/usr/include/QtGui -I/usr/include/QtDBus -I/usr/include -I. -Isource -Isource/dialogs -Isource/adaptors -Isource/right_panel -I. -I. -o searchlineedit.o source/searchlineedit.cpp
source/searchlineedit.cpp: In member function ‘void SearchLineEdit::init()’:
source/searchlineedit.cpp:70:57: error: cannot call constructor ‘QPalette::QPalette’ directly
source/searchlineedit.cpp:70:57: error: for a function-style cast, remove the redundant ‘::QPalette’
make: *** [searchlineedit.o] Error 1
- Apr 20 2011
WebRender

Browser by anandbose99k 16 comments

Currently there are many lightweight browsers in the web, but webrender is very fast and usable. Even private browsing is supported.
One thing I miss is tabbed browsing. Will you add this in the future? - Apr 02 2011
Antico Deluxe

Qt Tools by ludmiloff 32 comments

That was the key! I had to add

#include <X11/keysym.h>

to /wm/antico.h and it works. Thank you! - Jan 14 2009
Antico Deluxe

Qt Tools by ludmiloff 32 comments

In version 0.2-beta1 I get a new make error:

make[1]: Entering directory `/home/stekoe/downloads/antico-deluxe/95422-antico-deluxe-0.2-beta1/antico/wm'
/usr/bin/g++-4.1 -c -pipe -O2 -D_REENTRANT -Wall -W -DQT_NO_DEBUG -DQT_DBUS_LIB -DQT_GUI_LIB -DQT_CORE_LIB -DQT_SHARED -I/usr/share/qt4/mkspecs/default -I. -I/usr/include/QtCore -I/usr/include/QtCore -I/usr/include/QtGui -I/usr/include/QtGui -I/usr/include/QtDBus -I/usr/include/QtDBus -I/usr/include -I../amelib -I/usr/local/include/ame/ -I../build -Iforms -I/usr/include -Iforms -o ../build/antico.o antico.cpp
antico.cpp: In member function ‘virtual bool antico::x11EventFilter(XEvent*)’:
antico.cpp:317: error: ‘XK_Alt_L’ was not declared in this scope
antico.cpp:341: error: ‘XK_Alt_L’ was not declared in this scope
antico.cpp:350: error: ‘XK_F4’ was not declared in this scope
antico.cpp:362: error: ‘XK_F9’ was not declared in this scope

Am I missing some specific X11 header files? Thank you for your reply. - Jan 14 2009
Antico Deluxe

Qt Tools by ludmiloff 32 comments

I just would like to let you know, that I have successfully compiled antico-0.2-alpha3-1. Unfortunately I forgot to remove the header files of a previous installation (/usr/local/include/ame) - that was the problem. Sorry for bothering you. Now I am going to try the latest release...
What I really like is the gorgeous logout applet. - Jan 13 2009
Antico Deluxe

Qt Tools by ludmiloff 32 comments

Thank you for your time! - Jan 05 2009
Antico Deluxe

Qt Tools by ludmiloff 32 comments

Thank you for your reply. I guess this error is related to my compiler / system. I switched to gcc-4.1 and now the error described above does not appear anymore. Now I have a new one:

/usr/bin/g++-4.1 -c -pipe -O2 -O2 -g -march=i586 -mtune=i686 -fmessage-length=0 -D_REENTRANT -Wall -W -DQT_NO_DEBUG -DQT_DBUS_LIB -DQT_XML_LIB -DQT_GUI_LIB -DQT_CORE_LIB -DQT_SHARED -I/usr/share/qt4/mkspecs/default -I. -I/usr/include/QtCore -I/usr/include/QtCore -I/usr/include/QtGui -I/usr/include/QtGui -I/usr/include/QtXml -I/usr/include/QtXml -I/usr/include/QtDBus -I/usr/include/QtDBus -I/usr/include -I/usr/local/include/ame -I../amelib -I../build -Iforms -I/usr/include -Iforms -o ../build/sysprefwindow.o sysprefwindow.cpp
sysprefwindow.cpp: In member function ‘void SysPref::setupLaunchers()’:
sysprefwindow.cpp:113: error: no matching function for call to ‘SysPref::connect(AmeIconLink*&, const char [11], SysPref* const, const char [16])’
/usr/include/QtCore/qobject.h:197: note: candidates are: static bool QObject::connect(const QObject*, const char*, const QObject*, const char*, Qt::ConnectionType)
/usr/include/QtCore/qobject.h:302: note: bool QObject::connect(const QObject*, const char*, const char*, Qt::ConnectionType) const
sysprefwindow.cpp:116: error: no matching function for call to ‘SysPref::connect(AmeIconLink*&, const char [11], SysPref* const, const char [15])’
/usr/include/QtCore/qobject.h:197: note: candidates are: static bool QObject::connect(const QObject*, const char*, const QObject*, const char*, Qt::ConnectionType)
/usr/include/QtCore/qobject.h:302: note: bool QObject::connect(const QObject*, const char*, const char*, Qt::ConnectionType) const
sysprefwindow.cpp:121: error: no matching function for call to ‘SysPref::connect(AmeIconLink*&, const char [11], SysPref* const, const char [10])’
/usr/include/QtCore/qobject.h:197: note: candidates are: static bool QObject::connect(const QObject*, const char*, const QObject*, const char*, Qt::ConnectionType)
/usr/include/QtCore/qobject.h:302: note: bool QObject::connect(const QObject*, const char*, const char*, Qt::ConnectionType) const

If you have an idea, what might cause this error, please let me know.
But do not waste your time on troubleshooting my system.

Thank you! - Jan 05 2009
Antico Deluxe

Qt Tools by ludmiloff 32 comments

Thank you for your reply. I guess this error is related to my compiler / system. I switched to gcc-4.1 and now the error described above does not appear anymore. Now I have a new one:

/usr/bin/g++-4.1 -c -pipe -O2 -O2 -g -march=i586 -mtune=i686 -fmessage-length=0 -D_REENTRANT -Wall -W -DQT_NO_DEBUG -DQT_DBUS_LIB -DQT_XML_LIB -DQT_GUI_LIB -DQT_CORE_LIB -DQT_SHARED -I/usr/share/qt4/mkspecs/default -I. -I/usr/include/QtCore -I/usr/include/QtCore -I/usr/include/QtGui -I/usr/include/QtGui -I/usr/include/QtXml -I/usr/include/QtXml -I/usr/include/QtDBus -I/usr/include/QtDBus -I/usr/include -I/usr/local/include/ame -I../amelib -I../build -Iforms -I/usr/include -Iforms -o ../build/sysprefwindow.o sysprefwindow.cpp
sysprefwindow.cpp: In member function ‘void SysPref::setupLaunchers()’:
sysprefwindow.cpp:113: error: no matching function for call to ‘SysPref::connect(AmeIconLink*&, const char [11], SysPref* const, const char [16])’
/usr/include/QtCore/qobject.h:197: note: candidates are: static bool QObject::connect(const QObject*, const char*, const QObject*, const char*, Qt::ConnectionType)
/usr/include/QtCore/qobject.h:302: note: bool QObject::connect(const QObject*, const char*, const char*, Qt::ConnectionType) const
sysprefwindow.cpp:116: error: no matching function for call to ‘SysPref::connect(AmeIconLink*&, const char [11], SysPref* const, const char [15])’
/usr/include/QtCore/qobject.h:197: note: candidates are: static bool QObject::connect(const QObject*, const char*, const QObject*, const char*, Qt::ConnectionType)
/usr/include/QtCore/qobject.h:302: note: bool QObject::connect(const QObject*, const char*, const char*, Qt::ConnectionType) const
sysprefwindow.cpp:121: error: no matching function for call to ‘SysPref::connect(AmeIconLink*&, const char [11], SysPref* const, const char [10])’
/usr/include/QtCore/qobject.h:197: note: candidates are: static bool QObject::connect(const QObject*, const char*, const QObject*, const char*, Qt::ConnectionType)
/usr/include/QtCore/qobject.h:302: note: bool QObject::connect(const QObject*, const char*, const char*, Qt::ConnectionType) const

If you have an idea, what might cause this error, please let me know.
But do not waste your time on troubleshooting my system.

Thank you! - Jan 05 2009
Antico Deluxe

Qt Tools by ludmiloff 32 comments

Thank you for your reply. I guess this error is related to my compiler / system. I switched to gcc-4.1 and now the error described above does not appear anymore. Now I have a new one:

/usr/bin/g++-4.1 -c -pipe -O2 -O2 -g -march=i586 -mtune=i686 -fmessage-length=0 -D_REENTRANT -Wall -W -DQT_NO_DEBUG -DQT_DBUS_LIB -DQT_XML_LIB -DQT_GUI_LIB -DQT_CORE_LIB -DQT_SHARED -I/usr/share/qt4/mkspecs/default -I. -I/usr/include/QtCore -I/usr/include/QtCore -I/usr/include/QtGui -I/usr/include/QtGui -I/usr/include/QtXml -I/usr/include/QtXml -I/usr/include/QtDBus -I/usr/include/QtDBus -I/usr/include -I/usr/local/include/ame -I../amelib -I../build -Iforms -I/usr/include -Iforms -o ../build/sysprefwindow.o sysprefwindow.cpp
sysprefwindow.cpp: In member function ‘void SysPref::setupLaunchers()’:
sysprefwindow.cpp:113: error: no matching function for call to ‘SysPref::connect(AmeIconLink*&, const char [11], SysPref* const, const char [16])’
/usr/include/QtCore/qobject.h:197: note: candidates are: static bool QObject::connect(const QObject*, const char*, const QObject*, const char*, Qt::ConnectionType)
/usr/include/QtCore/qobject.h:302: note: bool QObject::connect(const QObject*, const char*, const char*, Qt::ConnectionType) const
sysprefwindow.cpp:116: error: no matching function for call to ‘SysPref::connect(AmeIconLink*&, const char [11], SysPref* const, const char [15])’
/usr/include/QtCore/qobject.h:197: note: candidates are: static bool QObject::connect(const QObject*, const char*, const QObject*, const char*, Qt::ConnectionType)
/usr/include/QtCore/qobject.h:302: note: bool QObject::connect(const QObject*, const char*, const char*, Qt::ConnectionType) const
sysprefwindow.cpp:121: error: no matching function for call to ‘SysPref::connect(AmeIconLink*&, const char [11], SysPref* const, const char [10])’
/usr/include/QtCore/qobject.h:197: note: candidates are: static bool QObject::connect(const QObject*, const char*, const QObject*, const char*, Qt::ConnectionType)
/usr/include/QtCore/qobject.h:302: note: bool QObject::connect(const QObject*, const char*, const char*, Qt::ConnectionType) const

If you have an idea, what might cause this error, please let me know.
But do not waste your time on troubleshooting my system.

Thank you! - Jan 05 2009
Antico Deluxe

Qt Tools by ludmiloff 32 comments

Thank you for your reply. I guess this error is related to my compiler / system. I switched to gcc-4.1 and now the error described above does not appear anymore. Now I have a new one:

/usr/bin/g++-4.1 -c -pipe -O2 -O2 -g -march=i586 -mtune=i686 -fmessage-length=0 -D_REENTRANT -Wall -W -DQT_NO_DEBUG -DQT_DBUS_LIB -DQT_XML_LIB -DQT_GUI_LIB -DQT_CORE_LIB -DQT_SHARED -I/usr/share/qt4/mkspecs/default -I. -I/usr/include/QtCore -I/usr/include/QtCore -I/usr/include/QtGui -I/usr/include/QtGui -I/usr/include/QtXml -I/usr/include/QtXml -I/usr/include/QtDBus -I/usr/include/QtDBus -I/usr/include -I/usr/local/include/ame -I../amelib -I../build -Iforms -I/usr/include -Iforms -o ../build/sysprefwindow.o sysprefwindow.cpp
sysprefwindow.cpp: In member function ‘void SysPref::setupLaunchers()’:
sysprefwindow.cpp:113: error: no matching function for call to ‘SysPref::connect(AmeIconLink*&, const char [11], SysPref* const, const char [16])’
/usr/include/QtCore/qobject.h:197: note: candidates are: static bool QObject::connect(const QObject*, const char*, const QObject*, const char*, Qt::ConnectionType)
/usr/include/QtCore/qobject.h:302: note: bool QObject::connect(const QObject*, const char*, const char*, Qt::ConnectionType) const
sysprefwindow.cpp:116: error: no matching function for call to ‘SysPref::connect(AmeIconLink*&, const char [11], SysPref* const, const char [15])’
/usr/include/QtCore/qobject.h:197: note: candidates are: static bool QObject::connect(const QObject*, const char*, const QObject*, const char*, Qt::ConnectionType)
/usr/include/QtCore/qobject.h:302: note: bool QObject::connect(const QObject*, const char*, const char*, Qt::ConnectionType) const
sysprefwindow.cpp:121: error: no matching function for call to ‘SysPref::connect(AmeIconLink*&, const char [11], SysPref* const, const char [10])’
/usr/include/QtCore/qobject.h:197: note: candidates are: static bool QObject::connect(const QObject*, const char*, const QObject*, const char*, Qt::ConnectionType)
/usr/include/QtCore/qobject.h:302: note: bool QObject::connect(const QObject*, const char*, const char*, Qt::ConnectionType) const

If you have an idea, what might cause this error, please let me know.
But do not waste your time on troubleshooting my system.

Thank you! - Jan 05 2009
Antico Deluxe

Qt Tools by ludmiloff 32 comments

Got this error during make (version 0.2-alpha3-1):

g++ -c -pipe -O2 -O2 -g -march=i586 -mcpu=i686 -fmessage-length=0 -D_REENTRANT -Wall -W -fPIC -DQT_NO_DEBUG -DQT_XML_LIB -DQT_GUI_LIB -DQT_CORE_LIB -DQT_SHARED -I/usr/share/qt4/mkspecs/default -I. -I/usr/include/QtCore -I/usr/include/QtCore -I/usr/include/QtGui -I/usr/include/QtGui -I/usr/include/QtXml -I/usr/include/QtXml -I/usr/include -I/usr/X11R6/include -I../build -I. -o ../build/mime.o mime.cpp
mime.cpp: In function `long unsigned int convert_number(const QByteArray&)':
mime.cpp:130: warning: converting of negative value `-1' to `long unsigned int'
mime.cpp: In function `QByteArray parse_string_mask(const char*, int)':
mime.cpp:179: error: syntax error before `;' token
mime.cpp: In member function `QString AmeMime::fromFileName(const QString&)':
mime.cpp:261: error: syntax error before `;' token
mime.cpp: In member function `QString AmeMime::fromFile(const QString&)':
mime.cpp:274: error: syntax error before `;' token

Do you have an idea? - Jan 04 2009
Groove

Ice-WM Themes by urukrama 4 comments

A really nice one. Where did you get the fonts and the wallpaper? - Nov 19 2007
easymount

System Software
by sadaszewski

6 .7
Apr 08 2013
6 .7
Mar 18 2013
QupZilla

Browser
by nowrep

8 .6
Jan 05 2012
X2

Text Editors
by njal

5 .8
Oct 20 2011
Coquillo

MP3 Taggers
by curfew

7 .9
Jun 25 2011
6 .3
9   Jun 16 2013
easymount

System Software
by sadaszewski

6 .7
9   Apr 08 2013
6 .7
9   Mar 18 2013
QupZilla

Browser
by nowrep

8 .6
9   Jan 05 2012
5 .8
9   Jun 26 2011
Coquillo

MP3 Taggers
by curfew

7 .9
9   Jun 25 2011