goLinuxSMS - goWinSMS

Utilities by AlterX 27 comments

A Slackware 10.2 TGZ Package is ready to download!!!

http://www.slacky.it


http://www.slacky.it/index.php?option=com_remository&Itemid=29&func=fileinfo&filecatid=699&parent=category - Nov 04 2005
ShowImg

Graphic Apps by rgroult 69 comments

A Slackware 10.2 TGZ Package is ready to download!!!

http://www.slacky.it


http://www.slacky.it/index.php?option=com_remository&Itemid=29&func=fileinfo&filecatid=663&parent=category - Nov 04 2005
K3b

Utilities by trueg 227 comments

A Slackware 10.2 TGZ Package is ready to download!!!

http://www.slacky.it

http://www.slacky.it/index.php?option=com_remository&Itemid=29&func=fileinfo&filecatid=342&parent=category - Nov 04 2005
Misfit Model 3D

Graphic Apps by kworces 9 comments

A SlackWare TGZ package is ready to download!!!!

http://www.slacky.it/


http://www.slacky.it/index.php?option=com_remository&Itemid=1&func=fileinfo&filecatid=720&parent=category - Nov 04 2005
k9copy

Utilities by jnmchlptt 244 comments

A Slackware's TGZ Package is ready to download!!!

http://www.slacky.it


http://www.slacky.it/index.php?option=com_remository&Itemid=29&func=fileinfo&filecatid=625&parent=category - Nov 03 2005
prokyon3

Audio Apps by mkalkbrenner 21 comments

I have compilation problem with my Slackware 10.2.This is the compiler's output:

main.cpp:40:27: xmlwrapp/init.h: No such file or directory
make[3]: *** [prokyon3-main.o] Error 1
make[3]: Leaving directory `/root/Desktop/prokyon/prokyon3-0.9.3RC2/src'
make[2]: *** [all] Error 2
make[2]: Leaving directory `/root/Desktop/prokyon/prokyon3-0.9.3RC2/src'
make[1]: *** [all-recursive] Error 1
make[1]: Leaving directory `/root/Desktop/prokyon/prokyon3-0.9.3RC2'
make: *** [all] Error 2
root@argo:~/Desktop/prokyon/prokyon3-0.9.3RC2#

Thank's for help ;) - Oct 29 2005
Klear

Video Apps by kraus 44 comments

Compilation Problems on my Slackware 10.2

The first is the wrong path of Qt in the Makefiles. I rewrite all the Makefiles with the good path for Slack /usr/lib/qt.

But now i have another problem, this is the compiler's output


App/EPG/CKlearAppDecodingTables.h:204: warning: `STR_TABLE
RunningStatus_Table[7]' defined but not used
App/EPG/CKlearAppDecodingTables.h:223: warning: `STR_TABLE TableIDs[48]'
defined but not used
App/EPG/CKlearAppDecodingTables.h:275: warning: `STR_TABLE Tags[63]' defined
but not used
App/EPG/CKlearAppDecodingTables.h:349: warning: `STR_TABLE TableIndicator[3]'
defined but not used
App/EPG/CKlearAppDecodingTables.h:359: warning: `STR_TABLE DescriptorTags[63]'
defined but not used
App/EPG/CKlearAppDecodingTables.h:433: warning: `STR_TABLE
ParentalRatingTable[18]' defined but not used
App/EPG/CKlearAppDecodingTables.h:459: warning: `STR_TABLE ContentTable[105]'
defined but not used
make[1]: *** [../bin/main.o] Error 1
make[1]: Leaving directory `/root/Desktop/klear/klear-0.5.1/src'
make: *** [sub-src] Error 2
root@argo:~/Desktop/klear/klear-0.5.1# - Oct 26 2005
goLinuxSMS - goWinSMS

Utilities by AlterX 27 comments

My Qt path is good.It's the standard on the Slackware 10.2
/usr/lib/qt/mkspecs/default/qmake.conf

but the output of the compiler give


/usr/lib/qt3/mkspecs/default/qmake.conf

Sono Italiano anch'io :) gohanz@infinito.it se puoi darmi una dritta!!


- Oct 25 2005
goLinuxSMS - goWinSMS

Utilities by AlterX 27 comments

There is no INSTALL instruction in source.
But i write
qmake and make, but this is the output of compiler, on my Slackware 10.2.
root@argo:~/Desktop/gosms/goSMS-1.0-source# qmake
root@argo:~/Desktop/gosms/goSMS-1.0-source# make
cd src && make -f Makefile
make[1]: Entering directory `/root/Desktop/gosms/goSMS-1.0-source/src'
make[1]: *** No rule to make target `/usr/share/qt3/mkspecs/default/qmake.conf', needed by `Makefile'. Stop.
make[1]: Leaving directory `/root/Desktop/gosms/goSMS-1.0-source/src'
make: *** [sub-src] Error 2
- Oct 25 2005
openc6

Chat & Messenging by openc6 6 comments

I have compilation problem with my slackware 10.2.
This is the output of compiler.
/configure: line 1352: syntax error near unexpected token `openc6,'
./configure: line 1352: `AM_INIT_AUTOMAKE(openc6, 0.9.6_beta)'
make: *** No targets specified and no makefile found. Stop.
make: *** No rule to make target `install'. Stop.
- Oct 24 2005
I have a compilation problem on my Slackware 10.2

This is the output of compiler:

usr/lib/gcc-lib/i486-slackware-linux/3.3.6/../../../../i486-slackware-linux/bin/ld: cannot find -ldb_cxx
collect2: ld returned 1 exit status
make[1]: *** [klibido] Error 1
make[1]: Leaving directory `/tmp/klibido-0.2.4.1/src'
make: *** [install-recursive] Error 1
- Oct 23 2005
KMediaNet

Video Apps by andresoton 13 comments

I have compilation Problem on my SlackWare 10.2, this is only the end of the compilation output

nmm.cpp:550: error: `int kndDebug()' previously defined here
nmm.cpp:889: error: redefinition of `int kndDebug()'
nmm.cpp:526: error: `int kndDebug()' previously defined here
nmm.cpp:889: error: syntax error before ` - Oct 23 2005
Kitty

Video Apps by kesiev 35 comments

Cool Application now i can compile it with my Slackware 10.2 :)
But where is the cat logo on the Kde Menu?
I can see only Kitty (Poadcast Client) without logo. ;) - Oct 22 2005
CalcChecksum

Security by michaelbuesch 6 comments

The Slackware's 10.2 package tgz, is ready.!!
http://www.slacky.it/
- Oct 20 2005
Konference

Video Apps by maldn 139 comments

Cool Work :D but i have compilation problem in my Slackware 10.2 and the latest FFmpeg release.
With the Old Version of FFmpeg no problem!! ;) - Oct 20 2005
KCheckGmail

Email by nascent 181 comments

Same problem don't save the correct password in my Slackware 10.2. - Oct 16 2005
Sticky Notes

Utilities by appy 5 comments

Very good Utility:) I made the tgz package for Slackware 10.2 - Oct 06 2005