Feff

Video Apps by admsasha 75 comments

Seem Feff doesn't work with the last FFmpeg-0.7.1.
When i try to select the path on /usr/bin i have this error (Incorrect path to ffmpeg or ffmpeg does not support).
Also the GUI translation show only the english.
My system is Italian localized.
- Jun 26 2011
Scan with ClamAV (extended)

Dolphin Service Menus by Incarus 77 comments

[Desktop Entry]
Type=Service
ServiceTypes=KonqPopupMenu/Plugin
MimeType=all/all;
X-KDE-StartupNotify=false
X-KDE-Priority=TopLevel
Actions=scanwithClam;

[Desktop Action scanwithClam]
Name=Scan with ClamAV
Name[de]=Mit ClamAV Scannen
Name[en]=Scan with ClamAV
Name[it]=Scansiona con ClamAV
Name[ru]=Сканирование ClamAV
Name[sv]=Skanna med ClamAV
Name[uk]=Сканування ClamAV
Exec[de]=kdialog --title "Scan mit ClamAV 1.3.4" --passivepopup "ClamAV scannt, bitte warten." 5 ; test -f /usr/bin/clamscan && kdialog --msgbox "Durchsuchte Datei(en): \n %F \n\n Resultat:\n `clamscan -i -r %F ` \n" --title "Scan mit ClamAV 1.3.4" || kdialog --msgbox "ClamAV ist nicht installiert! \n" --title "ClamAV nicht gefunden"
Exec[en]=kdialog --title "Scan with ClamAV 1.3.4" --passivepopup "ClamAV is scanning, please wait." 5 ; test -f /usr/bin/clamscan && kdialog --msgbox "Scanned file(s): \n %F \n\n Results:\n `clamscan -i -r %F ` \n" --title "Scan with ClamAV 1.3.4" || kdialog --msgbox "ClamAV is not installed! \n" --title "ClamAV not found"
Exec[it]=kdialog --title "Scansiona con ClamAV 1.3.4" --passivepopup "ClamAV sta scansionando, attendi per favore." 5 ; test -f /usr/bin/clamscan && kdialog --msgbox "Dati scansionati: \n %F \n\n Results:\n `clamscan -i -r %F ` \n" --title "Scansiona con ClamAV 1.3.4" || kdialog --msgbox "ClamAV non è installato! \n" --title "ClamAV non è stato trovato"
Exec[ru]=kdialog --title "Сканирование ClamAV 1.3.4" --passivepopup "ClamAV проводит сканирование. Пожалуйста, подождите." 5 ; test -f /usr/bin/clamscan && kdialog --msgbox "Проверенные файлы: \n %F \n\n Результат:\n `clamscan -i -r %F ` \n" --title "Сканирование ClamAV 1.3.4" || kdialog --msgbox "ClamAV не установлен! \n" --title "ClamAV не найден"
Exec[sv]=kdialog --title "Skanna med ClamAV 1.3.4" --passivepopup "ClamAV skannar, vänta." 5 ; test -f /usr/bin/clamscan && kdialog --msgbox "Skannade filer: \n %F \n\n Resultat:\n `clamscan -i -r %F ` \n" --title "Skanna med ClamAV 1.3.4" || kdialog --msgbox "ClamAV verkar inte vara installerat! \n" --title "ClamAV hittades inte"
Exec[uk]=kdialog --title "Сканування ClamAV 1.3.4" --passivepopup "ClamAV проводить сканування. Будь ласка, зачекайте." 5 ; test -f /usr/bin/clamscan && kdialog --msgbox "Перевірені файли: \n %F \n\n Результат:\n `clamscan -i -r %F ` \n" --title "Сканування ClamAV 1.3.4" || kdialog --msgbox "ClamAV не встановлено! \n" --title "ClamAV не знайдено"
Exec=kdialog --title "Scan with ClamAV 1.3.4" --passivepopup "ClamAV is scanning, please wait." 5 ; test -f /usr/bin/clamscan && kdialog --msgbox "Scanned file(s): \n %F \n\n Results:\n `clamscan -i -r %F ` \n" --title "Scan with ClamAV 1.3.4" || kdialog --msgbox "ClamAV is not installed! \n" --title "ClamAV not found"
Icon=security-medium - Jun 26 2011
KBookOCR

Office Apps by b0noI 55 comments

Yes i have Qt-4.7.0 on my Slackware 13.37.
And the previuos 1.4.1 version run without problems except the scanner.

This is 1.4.1 console output

> KBookocr
QMetaObject::connectSlotsByName: No matching signal for on_label_view1_linkActivated(QString)
(25515)/kdecore (services) KMimeTypeFactory::parseMagic: Now parsing "/usr/share/mime/magic"
(25515)/kdecore (services) KMimeTypeFactory::parseMagic: Now parsing "/root/.local/share/mime/magic"
- Jun 26 2011
KBookOCR

Office Apps by b0noI 55 comments

Yes i have Qt-4.7.0 on my Slackware 13.37.
And the previuos 1.4.1 version run without problems except the scanner.

This is 1.4.1 console output

> KBookocr
QMetaObject::connectSlotsByName: No matching signal for on_label_view1_linkActivated(QString)
(25515)/kdecore (services) KMimeTypeFactory::parseMagic: Now parsing "/usr/share/mime/magic"
(25515)/kdecore (services) KMimeTypeFactory::parseMagic: Now parsing "/root/.local/share/mime/magic"
- Jun 26 2011
Lyrics

Audio Apps by sinis 3 comments

It's possible to set the English as default language? Now the GUI show a Poland language. I'm on a Slackware 13.37 with Italian localization. - Jun 26 2011
KBookOCR

Office Apps by b0noI 55 comments

Yes it compile now, but i have a segfault on running.

> KBookocr
segmentation fault - Jun 24 2011
KBookOCR

Office Apps by b0noI 55 comments

This new 2.0 version doesn't compile on my Slackware 13.37. The previsuos 1.4.1 versio compile without problem.

This is the compiler's output.


kbookocr.cpp:918:6: warning: unused parameter ‘newValue’
kbookocr.cpp:1654:6: warning: unused parameter ‘value’
kbookocr.cpp:1775:6: warning: unused parameter ‘link’
kbookocr.cpp:1781:6: warning: unused parameter ‘checked’
kbookocr.cpp:1789:6: warning: unused parameter ‘checked’
kbookocr.cpp:1797:6: warning: unused parameter ‘checked’
kbookocr.cpp:1805:6: warning: unused parameter ‘checked’
kbookocr.cpp:1923:6: warning: unused parameter ‘action’
kbookocr.cpp: In member function ‘bool KBookocr::saveImages()’:
kbookocr.cpp:1522:1: warning: control reaches end of non-void function
g++ -c -pipe -O2 -march=i486 -mtune=i686 -Wall -W -D_REENTRANT -DQT_NO_DEBUG -DQT_GUI_LIB -DQT_CORE_LIB -DQT_SHARED -I/usr/lib/qt/mkspecs/linux-g++ -I. -I/usr/lib/qt/include/QtCore -I/usr/lib/qt/include/QtGui -I/usr/lib/qt/include -I/usr/include/poppler/qt4 -I. -I. -o convertingtoimgwite.o convertingtoimgwite.cpp
convertingtoimgwite.cpp:2:36: fatal error: ui_convertingtoimgwite.h: File o directory non esistente
compilation terminated.
make: *** [convertingtoimgwite.o] Errore 1



- Jun 23 2011
Kamerka

Graphic Apps by dos1 40 comments

Many thanks Kamerka work fine now!
Great App!!! - Jun 07 2011
Kamerka

Graphic Apps by dos1 40 comments

Yes this is the console output!

> kamerka
Kamerka version 0.6
Copyright (C) 2011 Sebastian Krzyszkowiak
Kamerka comes with ABSOLUTELY NO WARRANTY.
This is free software, and you are welcome to redistribute it
under certain conditions; type `./kamerka --license' for details.
qrc:/kamerka.qml:1:2: module "QtQuick" is not installed
QObject::connect: Cannot connect (null)::photoTaken() to MainWindow::photoTaken()
QObject::connect: Cannot connect (null)::timerCounter(int) to MainWindow::timerCounter(int)
QObject::connect: Cannot connect (null)::showDirectory() to MainWindow::showDirectory()
- Jun 07 2011
Kamerka

Graphic Apps by dos1 40 comments

This is a screenshot link.
http://img843.imageshack.us/i/schermata1wg.png/ - Jun 06 2011
Kamerka

Graphic Apps by dos1 40 comments

I'm on Slackware 13.37 i have compiled Kamerka with this trick sed -i 's/QT_PHONON_LIBRARY/KDE4_PHONON_LIBS/' src/CMakeLists.txt.
Now it run without problem. But i have only the preview window, without any menu or buttons!
The mouse right/left click seem not working.
- Jun 06 2011
KChildlock

System Software by LandertRene 68 comments

Many thanks! - May 17 2011
KChildlock

System Software by LandertRene 68 comments

I Have a compilation problem on my Slackware 13.37.

This is the compiler output

[ 96%] Generating index.cache.bz2
index.docbook:12: warning: failed to load external entity "dtd/kdex.dtd"
]>
^
index.docbook:25: parser error : Entity 'language' not defined
<book lang="&language;">
^
index.docbook:25: element book: validity error : No declaration for attribute lang of element book
<book lang="&language;">
^
index.docbook:31: element application: validity error : No declaration for element application
<title>The &kchildlock; Handbook</title>
^
index.docbook:31: element title: validity error : No declaration for element title
<title>The &kchildlock; Handbook</title>
^
index.docbook:35: element firstname: validity error : No declaration for element firstname
<firstname></firstname>
^
index.docbook:36: element othername: validity error : No declaration for element othername
<othername></othername>
.
.
.
.
index.docbook:687: element book: validity error : No declaration for element book
</book>
^
make[2]: *** [doc/en/index.cache.bz2] Errore 1
make[1]: *** [doc/en/CMakeFiles/en-handbook.dir/all] Errore 2
make: *** [all] Errore 2
- May 11 2011
Kadu Instant Messenger

Chat & Messenging by KaduTeam 6 comments

Many thanks! - Feb 21 2011
Kadu Instant Messenger

Chat & Messenging by KaduTeam 6 comments

The download server and the home page are both down! - Feb 04 2011
WatchVideo

Browser by fr33mind 33 comments

Many thanks WatchVideo work now! It's VLC required now? - Jan 02 2011
WatchVideo

Browser by fr33mind 33 comments

New new 2.0.3 version exit with error on my Slackware 13.1.

This is the shell output.


> watchvideo_gui
Traceback (most recent call last):
File "/usr/bin/watchvideo_gui", line 5, in <module>
from pkg_resources import load_entry_point
File "/usr/lib/python2.6/site-packages/pkg_resources.py", line 2603, in <module>
working_set.require(__requires__)
File "/usr/lib/python2.6/site-packages/pkg_resources.py", line 666, in require
needed = self.resolve(parse_requirements(requirements))
File "/usr/lib/python2.6/site-packages/pkg_resources.py", line 565, in resolve
raise DistributionNotFound(req) # XXX put more info here
pkg_resources.DistributionNotFound: GetMediumURL>=0.0a0
- Jan 02 2011
FreeDiams

Science by ericmaeker 9 comments

The Slackware 13.1 package is ready to download on www.slacky.eu.
Happy New Year!
http://www.slacky.eu/aadm/pkgs/index.php?ver=14&pkgname=freediams&pkgver=0.5.2

- Jan 01 2011
FreeDiams

Science by ericmaeker 9 comments

Many thanks now the Slackware package work fine!
Yes the package will be available, as soon as possible, on http://www.slacky.eu/ repository.

- Dec 26 2010
FreeDiams

Science by ericmaeker 9 comments

I'm try to build a Slackware package.
I see the build instructions on http://ericmaeker.fr/FreeMedForms/doc/buildinstructions.html

Ok i'm using this line on a build script

qmake freediams.pro -r -config release "CONFIG+=LINUX_INTEGRATED" "INSTALL_ROOT_PATH=$PKG/usr"

make && make install

where $PKG is a temp directory

The package is built without problem, but after installation the program exit with this error.

>freediams
freediams: error while loading shared libraries: libAggregation.so.1: cannot open shared object file: No such file or directory

Note that i have all libraries installed under /usr/lib/freediams

The program start only if i copy all libraries on /usr/lib, the standard libraries path.
Sorry for English. Can you help me?







- Dec 26 2010
FreeDiams

Science by ericmaeker 9 comments

I'm try to build a Slackware package.
I see the build instructions on http://ericmaeker.fr/FreeMedForms/doc/buildinstructions.html

Ok i'm using this line on a build script

qmake freediams.pro -r -config release "CONFIG+=LINUX_INTEGRATED" "INSTALL_ROOT_PATH=$PKG/usr"

make && make install

where $PKG is a temp directory

The package is built without problem, but after installation the program exit with this error.

>freediams
freediams: error while loading shared libraries: libAggregation.so.1: cannot open shared object file: No such file or directory

Note that i have all libraries installed under /usr/lib/freediams

The program start only if i copy all libraries on /usr/lib, the standard libraries path.
Sorry for English. Can you help me?







- Dec 26 2010
KBookOCR

Office Apps by b0noI 55 comments

Many thanks for info! - Nov 25 2010
KBookOCR

Office Apps by b0noI 55 comments

I have a compilation error on my slackware 13.1 with Qt-4.6.2.

kbookocr# qmake
make
g++ -c -pipe -O2 -march=i486 -mtune=i686 -Wall -W -D_REENTRANT -DQT_NO_DEBUG -DQT_GUI_LIB -DQT_CORE_LIB -DQT_SHARED -I/usr/lib/qt/mkspecs/linux-g++ -I. -I/usr/lib/qt/include/QtCore -I/usr/lib/qt/include/QtGui -I/usr/lib/qt/include -I/usr/include/poppler/qt4 -I. -I. -o kbookocr.o kbookocr.cpp
kbookocr.h: In constructor ‘KBookocr::KBookocr(QWidget*)’:
kbookocr.h:26: warning: ‘KBookocr::pdf’ will be initialized after
kbookocr.h:25: warning: ‘bool KBookocr::open’
kbookocr.cpp:12: warning: when initialized here
kbookocr.cpp: In member function ‘void KBookocr::on_pushButton_2_clicked()’:
kbookocr.cpp:110: warning: statement has no effect
kbookocr.cpp: At global scope:
kbookocr.cpp:192: warning: unused parameter ‘n’
kbookocr.cpp: In member function ‘void KBookocr::on_spinBox_3_valueChanged(int)’:
kbookocr.cpp:231: error: ‘class QPixmap’ has no member named ‘convertFromImage’
kbookocr.cpp: In member function ‘void KBookocr::previewDJVUChanged(int)’:
kbookocr.cpp:308: error: ‘class QPixmap’ has no member named ‘convertFromImage’
kbookocr.cpp: At global scope:
kbookocr.cpp:285: warning: unused parameter ‘n’
make: *** [kbookocr.o] Error 1
root@argo:~/kbookocr/kbookocr#

- Nov 25 2010
KGraphViewer and KGraphEditor

Graphic Apps by kleag 35 comments

The tarball link seems to be broken! - Nov 15 2010
KitchenSync

Groupware by denisq 32 comments

Many thanks the latest svn libopensync work! - Nov 09 2010
KitchenSync

Groupware by denisq 32 comments

Cmake report me an error. I have installed successfully, as dependencies, libopensynch 0.39.
Missing something other?

-- Found Qt-Version 4.6.2 (using /usr/bin/qmake)
-- Found X11: /usr/lib/libX11.so
-- Phonon Version: 4.4.1
-- Found KDE 4.4 include dir: /usr/include
-- Found KDE 4.4 library dir: /usr/lib
-- Found the KDE4 kconfig_compiler preprocessor: /usr/bin/kconfig_compiler
-- Found automoc4: /usr/bin/automoc4
-- WARNING: you are using the obsolete 'PKGCONFIG' macro use FindPkgConfig
-- checking for one of the modules 'libopensync1'
CMake Error at /usr/share/apps/cmake/modules/FindPkgConfig.cmake:366 (message):
None of the required 'libopensync1' found
Call Stack (most recent call first):
cmake/modules/FindOpenSync.cmake:29 (PKG_SEARCH_MODULE)
CMakeLists.txt:13 (FIND_PACKAGE)


CMake Error at cmake/modules/FindOpenSync.cmake:46 (MESSAGE):
OpenSync cmake modules not found. Have you installed opensync core or did
you set your PKG_CONFIG_PATH if installing in a non system directory ?
Call Stack (most recent call first):
CMakeLists.txt:13 (FIND_PACKAGE)


-- Configuring incomplete, errors occurred!
- Nov 09 2010
KitchenSync

Groupware by denisq 32 comments

Many thanks! - Nov 09 2010
KitchenSync

Groupware by denisq 32 comments

The tarball download link seem broken. - Nov 07 2010
WatchVideo

Browser by fr33mind 33 comments

Yes many thanks WatchVideo work fine now! - Nov 06 2010
WatchVideo

Browser by fr33mind 33 comments

Same problem on my Slackware 13.1.

watchvideo_gui
/usr/lib/python2.6/site-packages/gtk-2.0/gtk/__init__.py:127: RuntimeWarning: PyOS_InputHook is not available for interactive use of PyGTK
set_interactive(1)
(19689) KIconCache::Private::themeDirsChanged: Theme directory has been modified
mplayer: could not connect to socket
mplayer: No such file or directory
root@argo:~/watchvideo# watchvideo_gui
/usr/lib/python2.6/site-packages/gtk-2.0/gtk/__init__.py:127: RuntimeWarning: PyOS_InputHook is not available for interactive use of PyGTK
set_interactive(1)
mplayer: could not connect to socket
mplayer: No such file or directory
Traceback (most recent call last):
File "/usr/lib/python2.6/site-packages/watchvideo/watchvideo_gui.py", line 590, in showPreferences
self.dialogs['preferences'] = Preferences(self, self.settings)
File "/usr/lib/python2.6/site-packages/watchvideo/preferences.py", line 75, in __init__
self.updateGlobalQuality(0)
File "/usr/lib/python2.6/site-packages/watchvideo/preferences.py", line 117, in updateGlobalQuality
global_quality = self.getQualityFromAll()
File "/usr/lib/python2.6/site-packages/watchvideo/preferences.py", line 162, in getQualityFromAll
i += 1
UnboundLocalError: local variable 'i' referenced before assignment
Traceback (most recent call last):
File "/usr/lib/python2.6/site-packages/watchvideo/watchvideo_gui.py", line 590, in showPreferences
self.dialogs['preferences'] = Preferences(self, self.settings)
File "/usr/lib/python2.6/site-packages/watchvideo/preferences.py", line 75, in __init__
self.updateGlobalQuality(0)
File "/usr/lib/python2.6/site-packages/watchvideo/preferences.py", line 117, in updateGlobalQuality
global_quality = self.getQualityFromAll()
File "/usr/lib/python2.6/site-packages/watchvideo/preferences.py", line 162, in getQualityFromAll
i += 1
UnboundLocalError: local variable 'i' referenced before assignment
- Nov 06 2010
Wally

Utilities by becrux 45 comments

Many thanks your solution works! - Oct 20 2010
Wally

Utilities by becrux 45 comments

On my Slackware 13.1 with Qt4 4.6.2 and KDE 4.4.3 i have a compilation error. Note that the previuos stable Wally 2.3.2 version compile without problem. I have all Qt4 and KDE4 headers installed.
This is the error.

wally-2.4.1/wallyplugin/wallyplugin.cpp:44: error: ‘isPreviewing’ was not declared in this scope

- Oct 18 2010
SimpleAudioPlayer

Audioplayers by Knoellchen 14 comments

The mute button stop to work when i try to restart music.
Many thanks for the good app. - Oct 18 2010
Transcoder Audio Edition

Audio Extractors/Converters by chelovek84 10 comments

Please merge the video and audio apps in only one tool. - Oct 18 2010
CherryTree

Text Editors by giuspen 45 comments

Sorry Giuseppe maybe there is a misunderstanding?
I have to install the language files under /usr/share/locale but the setpu.py install under /usr/locale.
Maybe it's a bug?
Ciao
- Oct 17 2010
Meganizer

Various KDE Stuff by EngSaS 9 comments

Many thanks Meganizer work fine now! - Oct 17 2010
Meganizer

Various KDE Stuff by EngSaS 9 comments

Same problem with the lastest source. - Oct 17 2010
2ManDVD

Utilities by csgib 344 comments

I have compiled and installed successfully 2Mandvd 1.4.2, but the about window still report 1.4.1 version.
- Oct 17 2010
CherryTree

Text Editors by giuspen 45 comments

I'm on Slackware 13.1. Yes it's a problem with installation. The localization files are installed under /usr/locale directory. The good directory is /usr/share/locale.
I'm using this script to build a Slackware 13.1 package

http://repository.slacky.eu/slackware-13.1/utilities/cherrytree/0.14.2/src/ - Oct 15 2010
CherryTree

Text Editors by giuspen 45 comments

The language selector seem to be broken. If i try to select the Italian, Cherrytree restart with the default English localization. - Oct 15 2010
Meganizer

Various KDE Stuff by EngSaS 9 comments

I don't know if it is a bug. But on my Slackware 13.1 Meganizer start by default in German.
It's possible to enable the English language. - Oct 03 2010
Clementine

Audioplayers by davidsansome 66 comments

Same problem!

Slackware 13.1


> clementine
Error connecting to notifications service.
Couldn't register FTS3 tokenizer
Unable to update music library database
Abortito - Jun 30 2010
TicTacToe From Hell

Board by simone6192 4 comments

Many thanks for help! Now Tttfh compile without problem. - May 31 2010
TicTacToe From Hell

Board by simone6192 4 comments

This is the error on my Slackware 13.1. The previuos version compile without problem.


EBKIT_LIB -DQT_SCRIPT_LIB -DQT_SVG_LIB -DQT_GUI_LIB -DQT_NETWORK_LIB -DQT_CORE_LIB -DQT_SHARED -I/usr/lib/qt/mkspecs/linux-g++ -I. -I/usr/lib/qt/include/QtCore -I/usr/lib/qt/include/QtNetwork -I/usr/lib/qt/include/QtGui -I/usr/lib/qt/include/QtSvg -I/usr/lib/qt/include/QtScript -I/usr/lib/qt/include/QtWebKit -I/usr/lib/qt/include -I. -I. -o qrc_Icons.o qrc_Icons.cpp
/usr/lib/qt/bin/rcc -name Langs Langs.qrc -o qrc_Langs.cpp
RCC: Error in 'Langs.qrc': Cannot find file 'tttfh_it.qm'
make: *** [qrc_Langs.cpp] Error 1
root@argo:~/tttfh/tttfh-3.3.0-sources# mc - May 31 2010
luckyBackup

System Software by luckyb 243 comments

The source download link is broken!? - May 16 2010
Clementine

Audioplayers by davidsansome 66 comments

The last 0.3 Clementine fail to build on my Slackware 13.0 with Qt-4.5.1. This is the shell output.



clementine-0.3/build# make
[ 2%] Built target qtsingleapplication
[ 3%] Built target qxt
[ 3%] Building CXX object src/CMakeFiles/clementine_lib.dir/mainwindow.cpp.o
In file included from /tmp/txz/clementine-0.3/src/analyzers/analyzercontainer.h:24,
from /tmp/txz/clementine-0.3/build/src/ui_mainwindow.h:29,
from /tmp/txz/clementine-0.3/src/mainwindow.h:26,
from /tmp/txz/clementine-0.3/src/mainwindow.cpp:17:
/tmp/txz/clementine-0.3/src/analyzers/analyzerbase.h:19:37: error: QGLWidget: No such file or directory
In file included from /tmp/txz/clementine-0.3/src/playlist.h:26,
from /tmp/txz/clementine-0.3/src/playlistview.h:20,
from /tmp/txz/clementine-0.3/build/src/ui_mainwindow.h:33,
from /tmp/txz/clementine-0.3/src/mainwindow.h:26,
from /tmp/txz/clementine-0.3/src/mainwindow.cpp:17:
/tmp/txz/clementine-0.3/src/song.h:24:21: error: QSqlQuery: No such file or directory
In file included from /tmp/txz/clementine-0.3/src/library.h:24,
from /tmp/txz/clementine-0.3/src/playlistview.h:21,
from /tmp/txz/clementine-0.3/build/src/ui_mainwindow.h:33,
from /tmp/txz/clementine-0.3/src/mainwindow.h:26,
from /tmp/txz/clementine-0.3/src/mainwindow.cpp:17:
/tmp/txz/clementine-0.3/src/librarybackend.h:21:21: error: QSqlError: No such file or directory
/tmp/txz/clementine-0.3/src/librarybackend.h:22:24: error: QSqlDatabase: No such file or directory
In file included from /tmp/txz/clementine-0.3/src/mainwindow.cpp:18:
/tmp/txz/clementine-0.3/src/player.h:46:25: error: QDBusArgument: No such file or directory
In file included from /tmp/txz/clementine-0.3/src/lastfmservice.h:29,
from /tmp/txz/clementine-0.3/src/mainwindow.cpp:26:
/usr/include/lastfm/Track:26:23: error: QDomElement: No such file or directory
In file included from /tmp/txz/clementine-0.3/src/lastfmservice.h:30,
from /tmp/txz/clementine-0.3/src/mainwindow.cpp:26:
/usr/include/lastfm/ws.h:26:25: error: QNetworkReply: No such file or directory
In file included from /tmp/txz/clementine-0.3/src/mainwindow.cpp:26:
/tmp/txz/clementine-0.3/src/lastfmservice.h:39:33: error: QNetworkAccessManager: No such file or directory
In file included from /tmp/txz/clementine-0.3/src/librarybackend.h:28,
from /tmp/txz/clementine-0.3/src/library.h:24,
from /tmp/txz/clementine-0.3/src/playlistview.h:21,
from /tmp/txz/clementine-0.3/build/src/ui_mainwindow.h:33,
from /tmp/txz/clementine-0.3/src/mainwindow.h:26,
from /tmp/txz/clementine-0.3/src/mainwindow.cpp:17:
/tmp/txz/clementine-0.3/src/libraryquery.h:47: error: ‘QSqlError’ does not name a type
/tmp/txz/clementine-0.3/src/libraryquery.h:59: error: field ‘query_’ has incomplete type
/tmp/txz/clementine-0.3/src/libraryquery.h: In member function ‘LibraryQuery::operator const QSqlQuery&() const’:
/tmp/txz/clementine-0.3/src/libraryquery.h:51: error: ‘query_’ was not declared in this scope
In file included from /tmp/txz/clementine-0.3/src/library.h:24,
from /tmp/txz/clementine-0.3/src/playlistview.h:21,
from /tmp/txz/clementine-0.3/build/src/ui_mainwindow.h:33,
from /tmp/txz/clementine-0.3/src/mainwindow.h:26,
from /tmp/txz/clementine-0.3/src/mainwindow.cpp:17:
/tmp/txz/clementine-0.3/src/librarybackend.h: At global scope:
/tmp/txz/clementine-0.3/src/librarybackend.h:197: error: ‘QSqlDatabase’ does not name a type
/tmp/txz/clementine-0.3/src/librarybackend.h:198: error: ‘QSqlDatabase’ has not been declared
/tmp/txz/clementine-0.3/src/librarybackend.h:199: error: expected ‘,’ or ‘...’ before ‘&’ token
/tmp/txz/clementine-0.3/src/librarybackend.h:199: error: ISO C++ forbids declaration of ‘QSqlError’ with no type
/tmp/txz/clementine-0.3/src/librarybackend.h:206: error: ‘QSqlDatabase’ has not been declared
In file included from /tmp/txz/clementine-0.3/src/mainwindow.cpp:18:
/tmp/txz/clementine-0.3/src/player.h:47: error: expected constructor, destructor, or type conversion before ‘&’ token
/tmp/txz/clementine-0.3/src/player.h:48: error: expected initializer before ‘&’ token
In file included from /tmp/txz/clementine-0.3/src/lastfmservice.h:29,
from /tmp/txz/clementine-0.3/src/mainwindow.cpp:26:
/usr/include/lastfm/Track:85: error: expected ‘,’ or ‘...’ before ‘&’ token
/usr/include/lastfm/Track:132: error: ‘QDomElement’ does not name a type
In file included from /tmp/txz/clementine-0.3/src/lastfmservice.h:30,
from /tmp/txz/clementine-0.3/src/mainwindow.cpp:26:
/usr/include/lastfm/ws.h:152: error: ‘QNetworkReply::NetworkError’ has not been declared
In file included from /tmp/txz/clementine-0.3/src/mainwindow.cpp:26:
/tmp/txz/clementine-0.3/src/lastfmservice.h:182: error: field ‘network_’ has incomplete type
/usr/include/lastfm/global.h: In function ‘QString lastfm::qMetaEnumString(int, const char*) [with T = QNetworkReply]’:
/usr/include/lastfm/ws.h:154: instantiated from here
/usr/include/lastfm/global.h:51: error: incomplete type ‘QNetworkReply’ used in nested name specifier
make[2]: *** [src/CMakeFiles/clementine_lib.dir/mainwindow.cpp.o] Error 1
make[1]: *** [src/CMakeFiles/clementine_lib.dir/all] Error 2
make: *** [all] Error 2
root@argo:/tmp/txz/clementine-0.3/build# - May 09 2010
Sintegrial Text Editor

Text Editors by sintegrial 17 comments

Remove QScintilla system package before building STE, otherwise the compilation stop becasuse a linking problem. STE try to link system package instead the static Qscintilla version inside the source.
Same problem, solved, on my Slackware 13.0. - Mar 28 2010
BasKet Note Pads

Utilities by kelvie 347 comments

Many thanks, your suggestion work! :) - Mar 27 2010
ASTranslator

Education Apps by AlexBSnet 22 comments

Many thanks it work fine now! Please add the version to the about window. - Mar 25 2010
Clementine

Audioplayers by davidsansome 66 comments

Many thanks! The SVN version work like a charm!


>clementine
'Bringing joy to small mexican gerbils, a few weeks at a time.'
Couldn't resolve sqlite symbols
Updating compilations...
gapless playback enabled.
Scanning "/root/clementine"
"/root/clementine/Fabrizio De Andre' e PFM - Via del campo.mp3" created
"/root/clementine/Fabrizio De Andrè & PFM - Verranno a chiederti del nostro am.mp3" created
"/root/clementine/Fabrizio De Andre' & PFM - I dieci comandamenti.mp3" created
"/root/clementine/Fabrizio De Andrè - Il Gorilla.mp3" created
"/root/clementine/Fabrizio De Andrè - Vasco Rossi - Amico Fragile (live a Genova 12-3-2000).mp3" created
"/root/clementine/Fabrizio de Andre' & PFM - Verranno a chiederti del nostro amore.mp3" created
"/root/clementine/Fabrizio De Andrè & PFM - Andrea.mp3" created
"/root/clementine/Fabrizio De Andrè - Bocca di rosa.mp3" created
"/root/clementine/Fabrizio De Andrè - Il Pescatore.mp3" created
"/root/clementine/Fabrizio De Andrè - Geordie.mp3" created
TagLib: MPEG::Header::parse() -- Invalid sample rate.
TagLib: MPEG::Header::parse() -- Invalid sample rate.
"/root/clementine/Fabrizio De Andrè - Don Raffaè.mp3" created
"/root/clementine/Fabrizio De Andrè & PFM - Impressioni di Settembre.mp3" created
TagLib: MPEG::Header::parse() -- Invalid sample rate.
"/root/clementine/Fabrizio De Andrè & Guccini - La Fiera Della Maddalena.mp3" created
Finished scanning "/root/clementine"
Updating compilations...
void OSD::SongChanged(const Song&)
Before xine_open() *****
After xine_open() *****
Metadata received.
void OSD::SongChanged(const Song&) - Mar 24 2010