Linux MultiMedia Studio

Audio Apps by tobydox 114 comments

My System is SlackWare 10.2! - Jul 20 2006
Linux MultiMedia Studio

Audio Apps by tobydox 114 comments

I have Big Compilation problem with the last LMMS version. The configure script don't recognize the installed libraries.

configure: WARNING: fcntl.h: present but cannot be compiled
configure: WARNING: fcntl.h: check for missing prerequisite headers?
configure: WARNING: fcntl.h: see the Autoconf documentation
configure: WARNING: fcntl.h: section "Present But Cannot Be Compiled"
configure: WARNING: fcntl.h: proceeding with the preprocessor's result
configure: WARNING: fcntl.h: in the future, the compiler will take precedence
configure: WARNING: ## ------------------------------------------------------- ##
configure: WARNING: ## Report this to tobydox/at/users/dot/sourceforge/dot/net ##
configure: WARNING: ## ------------------------------------------------------- ##
checking for fcntl.h... yes
checking for memory.h... (cached) yes
checking for string.h... (cached) yes
checking sys/ioctl.h usability... no
checking sys/ioctl.h presence... yes
configure: WARNING: sys/ioctl.h: present but cannot be compiled
configure: WARNING: sys/ioctl.h: check for missing prerequisite headers?
configure: WARNING: sys/ioctl.h: see the Autoconf documentation
configure: WARNING: sys/ioctl.h: section "Present But Cannot Be Compiled"
configure: WARNING: sys/ioctl.h: proceeding with the preprocessor's result
configure: WARNING: sys/ioctl.h: in the future, the compiler will take precedence
configure: WARNING: ## ------------------------------------------------------- ##
configure: WARNING: ## Report this to tobydox/at/users/dot/sourceforge/dot/net ##
configure: WARNING: ## ------------------------------------------------------- ##
checking for sys/ioctl.h... yes
checking for unistd.h... (cached) yes
checking for stdlib.h... (cached) yes
checking pthread.h usability... no
checking pthread.h presence... yes
configure: WARNING: pthread.h: present but cannot be compiled
configure: WARNING: pthread.h: check for missing prerequisite headers?
configure: WARNING: pthread.h: see the Autoconf documentation
configure: WARNING: pthread.h: section "Present But Cannot Be Compiled"
configure: WARNING: pthread.h: proceeding with the preprocessor's result
configure: WARNING: pthread.h: in the future, the compiler will take precedence
configure: WARNING: ## ------------------------------------------------------- ##
configure: WARNING: ## Report this to tobydox/at/users/dot/sourceforge/dot/net ##
configure: WARNING: ## ------------------------------------------------------- ##
checking for pthread.h... yes
checking sys/ipc.h usability... no
checking sys/ipc.h presence... yes
configure: WARNING: sys/ipc.h: present but cannot be compiled
configure: WARNING: sys/ipc.h: check for missing prerequisite headers?
configure: WARNING: sys/ipc.h: see the Autoconf documentation
configure: WARNING: sys/ipc.h: section "Present But Cannot Be Compiled"
configure: WARNING: sys/ipc.h: proceeding with the preprocessor's result
configure: WARNING: sys/ipc.h: in the future, the compiler will take precedence
configure: WARNING: ## ------------------------------------------------------- ##
configure: WARNING: ## Report this to tobydox/at/users/dot/sourceforge/dot/net ##
configure: WARNING: ## ------------------------------------------------------- ##
checking for sys/ipc.h... yes
checking sys/shm.h usability... no
checking sys/shm.h presence... yes
configure: WARNING: sys/shm.h: present but cannot be compiled
configure: WARNING: sys/shm.h: check for missing prerequisite headers?
configure: WARNING: sys/shm.h: see the Autoconf documentation
configure: WARNING: sys/shm.h: section "Present But Cannot Be Compiled"
configure: WARNING: sys/shm.h: proceeding with the preprocessor's result
configure: WARNING: sys/shm.h: in the future, the compiler will take precedence
configure: WARNING: ## ------------------------------------------------------- ##
configure: WARNING: ## Report this to tobydox/at/users/dot/sourceforge/dot/net ##
configure: WARNING: ## ------------------------------------------------------- ##
checking for sys/shm.h... yes
checking sys/time.h usability... no
checking sys/time.h presence... yes
configure: WARNING: sys/time.h: present but cannot be compiled
configure: WARNING: sys/time.h: check for missing prerequisite headers?
configure: WARNING: sys/time.h: see the Autoconf documentation
configure: WARNING: sys/time.h: section "Present But Cannot Be Compiled"
configure: WARNING: sys/time.h: proceeding with the preprocessor's result
configure: WARNING: sys/time.h: in the future, the compiler will take precedence
configure: WARNING: ## ------------------------------------------------------- ##
configure: WARNING: ## Report this to tobydox/at/users/dot/sourceforge/dot/net ##
configure: WARNING: ## ------------------------------------------------------- ##
checking for sys/time.h... yes
checking sys/select.h usability... no
checking sys/select.h presence... yes
configure: WARNING: sys/select.h: present but cannot be compiled
configure: WARNING: sys/select.h: check for missing prerequisite headers?
configure: WARNING: sys/select.h: see the Autoconf documentation
configure: WARNING: sys/select.h: section "Present But Cannot Be Compiled"
configure: WARNING: sys/select.h: proceeding with the preprocessor's result
configure: WARNING: sys/select.h: in the future, the compiler will take precedence
configure: WARNING: ## ------------------------------------------------------- ##
configure: WARNING: ## Report this to tobydox/at/users/dot/sourceforge/dot/net ##
configure: WARNING: ## ------------------------------------------------------- ##
checking for sys/select.h... yes
checking for sys/types.h... (cached) yes
checking stdarg.h usability... no
checking stdarg.h presence... yes
configure: WARNING: stdarg.h: present but cannot be compiled
configure: WARNING: stdarg.h: check for missing prerequisite headers?
configure: WARNING: stdarg.h: see the Autoconf documentation
configure: WARNING: stdarg.h: section "Present But Cannot Be Compiled"
configure: WARNING: stdarg.h: proceeding with the preprocessor's result
configure: WARNING: stdarg.h: in the future, the compiler will take precedence
configure: WARNING: ## ------------------------------------------------------- ##
configure: WARNING: ## Report this to tobydox/at/users/dot/sourceforge/dot/net ##
configure: WARNING: ## ------------------------------------------------------- ##
checking for stdarg.h... yes
checking signal.h usability... no
checking signal.h presence... yes
configure: WARNING: signal.h: present but cannot be compiled
configure: WARNING: signal.h: check for missing prerequisite headers?
configure: WARNING: signal.h: see the Autoconf documentation
configure: WARNING: signal.h: section "Present But Cannot Be Compiled"
configure: WARNING: signal.h: proceeding with the preprocessor's result
configure: WARNING: signal.h: in the future, the compiler will take precedence
configure: WARNING: ## ------------------------------------------------------- ##
configure: WARNING: ## Report this to tobydox/at/users/dot/sourceforge/dot/net ##
configure: WARNING: ## ------------------------------------------------------- ##
checking for signal.h... yes
checking sched.h usability... no
checking sched.h presence... yes
configure: WARNING: sched.h: present but cannot be compiled
configure: WARNING: sched.h: check for missing prerequisite headers?
configure: WARNING: sched.h: see the Autoconf documentation
configure: WARNING: sched.h: section "Present But Cannot Be Compiled"
configure: WARNING: sched.h: proceeding with the preprocessor's result
configure: WARNING: sched.h: in the future, the compiler will take precedence
configure: WARNING: ## ------------------------------------------------------- ##
configure: WARNING: ## Report this to tobydox/at/users/dot/sourceforge/dot/net ##
configure: WARNING: ## ------------------------------------------------------- ##
checking for sched.h... yes
checking for an ANSI C-conforming const... no
checking for inline... no
checking for size_t... no
checking whether time.h and sys/time.h may both be included... no
checking whether struct tm is in sys/time.h or time.h... sys/time.h
checking for working volatile... no
checking whether byte ordering is bigendian... yes
checking for mode_t... no
checking for off_t... no
checking for pid_t... no
checking for size_t... (cached) no
checking for ssize_t... no
checking for long long... no
checking for working alloca.h... no
checking for alloca... no
checking whether `alloca.c' needs Cray hooks... no
checking stack direction for C alloca... -1
checking for stdlib.h... (cached) yes
checking for GNU libc compatible malloc... no
checking for working memcmp... no
checking return type of signal handlers... int
checking for usleep... no
checking for pipe... no
checking for sprintf... no
checking SDL/SDL.h usability... no
checking SDL/SDL.h presence... yes
configure: WARNING: SDL/SDL.h: present but cannot be compiled
configure: WARNING: SDL/SDL.h: check for missing prerequisite headers?
configure: WARNING: SDL/SDL.h: see the Autoconf documentation
configure: WARNING: SDL/SDL.h: section "Present But Cannot Be Compiled"
configure: WARNING: SDL/SDL.h: proceeding with the preprocessor's result
configure: WARNING: SDL/SDL.h: in the future, the compiler will take precedence
configure: WARNING: ## ------------------------------------------------------- ##
configure: WARNING: ## Report this to tobydox/at/users/dot/sourceforge/dot/net ##
configure: WARNING: ## ------------------------------------------------------- ##
checking for SDL/SDL.h... yes
checking SDL/SDL_audio.h usability... no
checking SDL/SDL_audio.h presence... yes
configure: WARNING: SDL/SDL_audio.h: present but cannot be compiled
configure: WARNING: SDL/SDL_audio.h: check for missing prerequisite headers?
configure: WARNING: SDL/SDL_audio.h: see the Autoconf documentation
configure: WARNING: SDL/SDL_audio.h: section "Present But Cannot Be Compiled"
configure: WARNING: SDL/SDL_audio.h: proceeding with the preprocessor's result
configure: WARNING: SDL/SDL_audio.h: in the future, the compiler will take precedence
configure: WARNING: ## ------------------------------------------------------- ##
configure: WARNING: ## Report this to tobydox/at/users/dot/sourceforge/dot/net ##
configure: WARNING: ## ------------------------------------------------------- ##
checking for SDL/SDL_audio.h... yes
checking for SDL_OpenAudio in -lSDL... no
checking SDL/SDL_sound.h usability... no
checking SDL/SDL_sound.h presence... no
checking for SDL/SDL_sound.h... no
checking for Sound_Init in -lSDL_sound... no
checking alsa/asoundlib.h usability... no
checking alsa/asoundlib.h presence... yes
configure: WARNING: alsa/asoundlib.h: present but cannot be compiled
configure: WARNING: alsa/asoundlib.h: check for missing prerequisite headers?
configure: WARNING: alsa/asoundlib.h: see the Autoconf documentation
configure: WARNING: alsa/asoundlib.h: section "Present But Cannot Be Compiled"
configure: WARNING: alsa/asoundlib.h: proceeding with the preprocessor's result
configure: WARNING: alsa/asoundlib.h: in the future, the compiler will take precedence
configure: WARNING: ## ------------------------------------------------------- ##
configure: WARNING: ## Report this to tobydox/at/users/dot/sourceforge/dot/net ##
configure: WARNING: ## ------------------------------------------------------- ##
checking for alsa/asoundlib.h... yes
checking for snd_pcm_open in -lasound... no
checking sys/soundcard.h usability... no
checking sys/soundcard.h presence... yes
configure: WARNING: sys/soundcard.h: present but cannot be compiled
configure: WARNING: sys/soundcard.h: check for missing prerequisite headers?
configure: WARNING: sys/soundcard.h: see the Autoconf documentation
configure: WARNING: sys/soundcard.h: section "Present But Cannot Be Compiled"
configure: WARNING: sys/soundcard.h: proceeding with the preprocessor's result
configure: WARNING: sys/soundcard.h: in the future, the compiler will take precedence
configure: WARNING: ## ------------------------------------------------------- ##
configure: WARNING: ## Report this to tobydox/at/users/dot/sourceforge/dot/net ##
configure: WARNING: ## ------------------------------------------------------- ##
checking for sys/soundcard.h... yes
checking soundcard.h usability... no
checking soundcard.h presence... no
checking for soundcard.h... no
checking jack/jack.h usability... no
checking jack/jack.h presence... yes
configure: WARNING: jack/jack.h: present but cannot be compiled
configure: WARNING: jack/jack.h: check for missing prerequisite headers?
configure: WARNING: jack/jack.h: see the Autoconf documentation
configure: WARNING: jack/jack.h: section "Present But Cannot Be Compiled"
configure: WARNING: jack/jack.h: proceeding with the preprocessor's result
configure: WARNING: jack/jack.h: in the future, the compiler will take precedence
configure: WARNING: ## ------------------------------------------------------- ##
configure: WARNING: ## Report this to tobydox/at/users/dot/sourceforge/dot/net ##
configure: WARNING: ## ------------------------------------------------------- ##
checking for jack/jack.h... yes
checking for jack_client_new in -ljack... no
checking for jack_client_open in -ljack... no
checking ladspa.h usability... no
checking ladspa.h presence... yes
configure: WARNING: ladspa.h: present but cannot be compiled
configure: WARNING: ladspa.h: check for missing prerequisite headers?
configure: WARNING: ladspa.h: see the Autoconf documentation
configure: WARNING: ladspa.h: section "Present But Cannot Be Compiled"
configure: WARNING: ladspa.h: proceeding with the preprocessor's result
configure: WARNING: ladspa.h: in the future, the compiler will take precedence
configure: WARNING: ## ------------------------------------------------------- ##
configure: WARNING: ## Report this to tobydox/at/users/dot/sourceforge/dot/net ##
configure: WARNING: ## ------------------------------------------------------- ##
checking for ladspa.h... yes
checking vorbis/codec.h usability... no
checking vorbis/codec.h presence... yes
configure: WARNING: vorbis/codec.h: present but cannot be compiled
configure: WARNING: vorbis/codec.h: check for missing prerequisite headers?
configure: WARNING: vorbis/codec.h: see the Autoconf documentation
configure: WARNING: vorbis/codec.h: section "Present But Cannot Be Compiled"
configure: WARNING: vorbis/codec.h: proceeding with the preprocessor's result
configure: WARNING: vorbis/codec.h: in the future, the compiler will take precedence
configure: WARNING: ## ------------------------------------------------------- ##
configure: WARNING: ## Report this to tobydox/at/users/dot/sourceforge/dot/net ##
configure: WARNING: ## ------------------------------------------------------- ##
checking for vorbis/codec.h... yes
checking vorbis/vorbisenc.h usability... no
checking vorbis/vorbisenc.h presence... yes
configure: WARNING: vorbis/vorbisenc.h: present but cannot be compiled
configure: WARNING: vorbis/vorbisenc.h: check for missing prerequisite headers?
configure: WARNING: vorbis/vorbisenc.h: see the Autoconf documentation
configure: WARNING: vorbis/vorbisenc.h: section "Present But Cannot Be Compiled"
configure: WARNING: vorbis/vorbisenc.h: proceeding with the preprocessor's result
configure: WARNING: vorbis/vorbisenc.h: in the future, the compiler will take precedence
configure: WARNING: ## ------------------------------------------------------- ##
configure: WARNING: ## Report this to tobydox/at/users/dot/sourceforge/dot/net ##
configure: WARNING: ## ------------------------------------------------------- ##
checking for vorbis/vorbisenc.h... yes
checking vorbis/vorbisfile.h usability... no
checking vorbis/vorbisfile.h presence... yes
configure: WARNING: vorbis/vorbisfile.h: present but cannot be compiled
configure: WARNING: vorbis/vorbisfile.h: check for missing prerequisite headers?
configure: WARNING: vorbis/vorbisfile.h: see the Autoconf documentation
configure: WARNING: vorbis/vorbisfile.h: section "Present But Cannot Be Compiled"
configure: WARNING: vorbis/vorbisfile.h: proceeding with the preprocessor's result
configure: WARNING: vorbis/vorbisfile.h: in the future, the compiler will take precedence
configure: WARNING: ## ------------------------------------------------------- ##
configure: WARNING: ## Report this to tobydox/at/users/dot/sourceforge/dot/net ##
configure: WARNING: ## ------------------------------------------------------- ##
checking for vorbis/vorbisfile.h... yes
checking for vorbis_analysis in -lvorbis... no
checking FLAC/stream_encoder.h usability... no
checking FLAC/stream_encoder.h presence... yes
configure: WARNING: FLAC/stream_encoder.h: present but cannot be compiled
configure: WARNING: FLAC/stream_encoder.h: check for missing prerequisite headers?
configure: WARNING: FLAC/stream_encoder.h: see the Autoconf documentation
configure: WARNING: FLAC/stream_encoder.h: section "Present But Cannot Be Compiled"
configure: WARNING: FLAC/stream_encoder.h: proceeding with the preprocessor's result
configure: WARNING: FLAC/stream_encoder.h: in the future, the compiler will take precedence
configure: WARNING: ## ------------------------------------------------------- ##
configure: WARNING: ## Report this to tobydox/at/users/dot/sourceforge/dot/net ##
configure: WARNING: ## ------------------------------------------------------- ##
checking for FLAC/stream_encoder.h... yes
checking FLAC/stream_decoder.h usability... no
checking FLAC/stream_decoder.h presence... yes
configure: WARNING: FLAC/stream_decoder.h: present but cannot be compiled
configure: WARNING: FLAC/stream_decoder.h: check for missing prerequisite headers?
configure: WARNING: FLAC/stream_decoder.h: see the Autoconf documentation
configure: WARNING: FLAC/stream_decoder.h: section "Present But Cannot Be Compiled"
configure: WARNING: FLAC/stream_decoder.h: proceeding with the preprocessor's result
configure: WARNING: FLAC/stream_decoder.h: in the future, the compiler will take precedence
configure: WARNING: ## ------------------------------------------------------- ##
configure: WARNING: ## Report this to tobydox/at/users/dot/sourceforge/dot/net ##
configure: WARNING: ## ------------------------------------------------------- ##
checking for FLAC/stream_decoder.h... yes
checking for FLAC__stream_encoder_new in -lFLAC... no
checking samplerate.h usability... no
checking samplerate.h presence... yes
configure: WARNING: samplerate.h: present but cannot be compiled
configure: WARNING: samplerate.h: check for missing prerequisite headers?
configure: WARNING: samplerate.h: see the Autoconf documentation
configure: WARNING: samplerate.h: section "Present But Cannot Be Compiled"
configure: WARNING: samplerate.h: proceeding with the preprocessor's result
configure: WARNING: samplerate.h: in the future, the compiler will take precedence
configure: WARNING: ## ------------------------------------------------------- ##
configure: WARNING: ## Report this to tobydox/at/users/dot/sourceforge/dot/net ##
configure: WARNING: ## ------------------------------------------------------- ##
checking for samplerate.h... yes
checking for src_simple in -lsamplerate... no
checking sndfile.h usability... no
checking sndfile.h presence... yes
configure: WARNING: sndfile.h: present but cannot be compiled
configure: WARNING: sndfile.h: check for missing prerequisite headers?
configure: WARNING: sndfile.h: see the Autoconf documentation
configure: WARNING: sndfile.h: section "Present But Cannot Be Compiled"
configure: WARNING: sndfile.h: proceeding with the preprocessor's result
configure: WARNING: sndfile.h: in the future, the compiler will take precedence
configure: WARNING: ## ------------------------------------------------------- ##
configure: WARNING: ## Report this to tobydox/at/users/dot/sourceforge/dot/net ##
configure: WARNING: ## ------------------------------------------------------- ##
checking for sndfile.h... yes
checking for sf_command in -lsndfile... no
checking version of libsndfile... < 1.0.11
checking whether to disable surround-support... no
checking whether to enable high quality sinc-resampling... no
checking whether to disable single-source-compile... no
checking whether we can use function-attribute regparm(x) on current platform... no
checking whether floorf is known by compiler... no - will use floor instead
checking whether powf is known by compiler... no - will use pow instead
checking whether fabsf is known by compiler... no - will use fabs instead
checking whether logf is known by compiler... no - will use log instead
checking whether to enable debugging-code... no
checking for rpm sources path... /usr/src/rpm/SOURCES/
configure: creating ./config.status
- Jul 20 2006
Beesoft Commander

System Software by piotrpsz 52 comments

A SlackWare TGz package with SlackBuild Script is Ready to DownLoad!!!

http://www.slacky.it/

http://www.slacky.it/index.php?option=com_remository&Itemid=29&func=fileinfo&id=1001 - Jul 19 2006
KsirK

Tactics & Strategy by kleag 82 comments

In the ksirk.desktop file, there is no Categories. Than the ksirk voice is not present in Kmenu after make install.
I have modified it!

# KDE Config File
[Desktop Entry]
Type=Application
Exec=ksirk -caption "%c" %i %m
Icon=ksirk.png
MiniIcon=ksirk.png
DocPath=ksirk/index.html
Comment=KsirK is a computerized version of a strategy board game: Risk !
Comment[de]=
Comment[it]=Ksirk è la versione computerizzata del gioco da tavolo strategico: Risico!
Terminal=0
Name=KsirK
Name[de]=KsirK
Name[it]=Ksirk
GenericName=Risk Computerized
GenericName[de]=
GenericName[it]=Risico Computerizzato
Categories=Qt;KDE;Game;StrategyGame; - Jul 18 2006
KsirK

Tactics & Strategy by kleag 82 comments

The "make install DESTDIR" is not implemented? It's usefull for build a package! - Jul 17 2006
ScreenKast

Screen Recorders by beligum 90 comments

I still have problem, with the SlackWare 10.2.

checking for XtToolkitInitialize in -lXt... no
configure: error: *** X toolkit libraries missing - please install libxt development package ***
make: *** No targets specified and no makefile found. Stop.
make: *** No rule to make target `install'. Stop.

Can you tell me, how can i solve it? Thank's! - Jul 15 2006
OpenOffice.org Quickstarter 2

Utilities by SegFault 13 comments

A SlackWare TGz package with SlackBuild Script is Ready to DownLoad!!!

http://www.slacky.it/


http://www.slacky.it/index.php?option=com_remository&Itemid=29&func=fileinfo&id=448 - Jul 13 2006
KPack (package installer)

Various KDE 1.-4. Improvements by sabby7890 18 comments

SlackWare TGZ package support? - Jul 08 2006
Kdenlive

Video Apps by jbm 77 comments

A SlackWare TGz package with SlackBuild Script is Ready to DownLoad!!!

http://www.slacky.it/

http://www.slacky.it/index.php?option=com_remository&Itemid=29&func=fileinfo&id=1124 - Jul 04 2006
Tasty Menu

Various KDE 1.-4. Improvements by mart 499 comments

A SlackWare TGz package with SlackBuild Script is Ready to DownLoad!!!

http://www.slacky.it/



http://www.slacky.it/index.php?option=com_remository&Itemid=29&func=fileinfo&id=1236 - Jul 04 2006
ScreenKast

Screen Recorders by beligum 90 comments

I compile the libinstrudeo good!
I have problem only with sreenKast and X11 library - Jul 04 2006
ScreenKast

Screen Recorders by beligum 90 comments

I have compilation Problem with my slackWare 10.2
This is the compiler's output

make[3]: Nothing to be done for `install-data-am'.
make[3]: Leaving directory `/tmp/screenKast-0.1/isdvncviewer/isdvncpasswd'
make[2]: Leaving directory `/tmp/screenKast-0.1/isdvncviewer/isdvncpasswd'
Making install in isdvncviewer
make[2]: Entering directory `/tmp/screenKast-0.1/isdvncviewer/isdvncviewer'
/bin/sh ../../libtool --silent --tag=CC --mode=link i486-slackware-linux-gcc -ansi -W -Wall -Wchar-subscripts -Wshadow -Wpointer-arith -Wmissing-prototypes -Wwrite-strings -D_XOPEN_SOURCE=500 -D_BSD_SOURCE -DNDEBUG -O2 -O2 -march=i486 -mcpu=i686 -Wformat-security -Wmissing-format-attribute -o isdvncviewer argsresources.o colour.o cursor.o debug.o desktop.o dialogs.o fullscreen.o listen.o misc.o popup.o record.o rfbproto.o selection.o shm.o sockets.o tunnel.o vncviewer.o ../../isdvncviewer/libisdvncauth/libisdvncauth.a -lXaw -lXmu -lXt -lSM -lICE -lXpm -lXext -lX11 -lz -ljpeg
/usr/lib/gcc-lib/i486-slackware-linux/3.3.6/../../../../i486-slackware-linux/bin/ld: cannot find -lXaw
collect2: ld returned 1 exit status
make[2]: *** [isdvncviewer] Error 1
make[2]: Leaving directory `/tmp/screenKast-0.1/isdvncviewer/isdvncviewer'
make[1]: *** [install-recursive] Error 1
make[1]: Leaving directory `/tmp/screenKast-0.1/isdvncviewer'
make: *** [install-recursive] Error 1
- Jul 04 2006
PoDoFoBrowser

Utilities by domseichter 3 comments

A SlackWare TGz package with SlackBuild Script is Ready to DownLoad!!!

http://www.slacky.it/


http://www.slacky.it/index.php?option=com_remository&Itemid=29&func=fileinfo&id=1234 - Jul 04 2006
PoDoFoBrowser

Utilities by domseichter 3 comments

A SlackWare TGz package with SlackBuild Script is Ready to DownLoad!!!

http://www.slacky.it/


http://www.slacky.it/index.php?option=com_remository&Itemid=29&func=fileinfo&id=1234 - Jul 04 2006
kX Generator

System Software by sabby7890 79 comments

A SlackWare TGz package with SlackBuild Script is Ready to DownLoad!!!

http://www.slacky.it/

http://www.slacky.it/index.php?option=com_remository&Itemid=29&func=fileinfo&id=1220 - Jun 30 2006
MPlayerThumbs

Video Apps by RockMan81 102 comments

A SlackWare TGz package with SlackBuild Script is Ready to DownLoad!!!

http://www.slacky.it/

http://www.slacky.it/index.php?option=com_remository&Itemid=29&func=fileinfo&id=1217 - Jun 29 2006
MPlayerThumbs

Video Apps by RockMan81 102 comments

Whith the last version, it work fine on my Slackware!;) - Jun 29 2006
MPlayerThumbs

Video Apps by RockMan81 102 comments

This is my log


stderr is not a tty - where are you?
xset: bad font path element (#158), possible causes are:
Directory does not exist or has wrong permissions
Directory missing fonts.dir
Incorrect font server address or syntax
startkde: Starting up...
kbuildsycoca running...
kdecore (KLibLoader): WARNING: KLibrary: /opt/kde/lib/kde3/kcm_kdnssd.so: undefined symbol: init_kdnssd
opera: [java] Disabling java due to potential problems. If you know
what you are doing, you can set the environment variable
OPERA_FORCE_JAVA_ENABLED to '1' to override this.
Start Opera with '-debugjava' argument for more information.

opera: spellcheck.so: cannot open shared object file: No such file or directory
kio (KIOConnection): ERROR: Header read failed, errno=104
kio (KIOConnection): ERROR: Header has invalid size (-1)
kio (KIOConnection): ERROR: Header read failed, errno=104
kio (KIOConnection): ERROR: Header has invalid size (-1)
kio (KLauncher): ERROR: SlavePool: No communication with slave.
kio (KLauncher): ERROR: SlavePool: No communication with slave.
kio (KIOConnection): ERROR: Header read failed, errno=104
kio (KIOConnection): ERROR: Header has invalid size (-1)
kio (KIOConnection): ERROR: Header read failed, errno=104
kio (KIOConnection): ERROR: Header has invalid size (-1)
kio (KIOConnection): ERROR: Header read failed, errno=104
kio (KIOConnection): ERROR: Header has invalid size (-1)
kio (KLauncher): ERROR: SlavePool: No communication with slave.
kio (KIOConnection): ERROR: Header read failed, errno=104
kio (KIOConnection): ERROR: Header has invalid size (-1)
kio (KLauncher): ERROR: SlavePool: No communication with slave.
kmail: ERROR: : couldn't create slave : Impossibile creare un io-slave:
klauncher ha detto: Protocollo "cid" sconosciuto.
kmail:
kmail: ERROR: : couldn't create slave : Impossibile creare un io-slave:
klauncher ha detto: Protocollo "cid" sconosciuto.
kmail:
gmplayer: error while loading shared libraries: libmpcdec.so.3: cannot open shared object file: No such file or directory
gmplayer: error while loading shared libraries: libmpcdec.so.3: cannot open shared object file: No such file or directory
X Error: BadWindow (invalid Window parameter) 3
Major opcode: 20
Minor opcode: 0
Resource id: 0x2e01069
X Error: BadWindow (invalid Window parameter) 3
Major opcode: 20
Minor opcode: 0
Resource id: 0x2e00bc6
X Error: BadWindow (invalid Window parameter) 3
Major opcode: 20
Minor opcode: 0
Resource id: 0x2e00bc6
X Error: BadWindow (invalid Window parameter) 3
Major opcode: 20
Minor opcode: 0
Resource id: 0x2e00bc6
X Error: BadWindow (invalid Window parameter) 3
Major opcode: 20
Minor opcode: 0
Resource id: 0x2e00bc6
X Error: BadWindow (invalid Window parameter) 3
Major opcode: 20
Minor opcode: 0
Resource id: 0x2600005
X Error: BadWindow (invalid Window parameter) 3
Major opcode: 7
Minor opcode: 0
Resource id: 0x2000005
X Error: BadWindow (invalid Window parameter) 3
Major opcode: 6
Minor opcode: 0
Resource id: 0x2000005
X Error: BadWindow (invalid Window parameter) 3
Major opcode: 7
Minor opcode: 0
Resource id: 0x220000b
X Error: BadWindow (invalid Window parameter) 3
Major opcode: 6
Minor opcode: 0
Resource id: 0x220000b
X Error: BadWindow (invalid Window parameter) 3
Major opcode: 7
Minor opcode: 0
Resource id: 0x2400017
X Error: BadWindow (invalid Window parameter) 3
Major opcode: 6
Minor opcode: 0
Resource id: 0x2400017
WARNING: deleting stale lockfile /root/.kde/share/config/kdeglobals.lock
WARNING: deleting stale lockfile /root/.kde/share/config/kdeglobals.lock
startkde: Shutting down...
klauncher: Exiting on signal 1
KWrited - Ascolto il dispositivo /dev/pts/0
startkde: Running shutdown scripts...
startkde: Done.
- Jun 27 2006
MPlayerThumbs

Video Apps by RockMan81 102 comments

I have installed it. But i don't see any Thoumbs from Konqueror.

Kde 3.4.2 SlackWare 10.2 - Jun 26 2006
Amarok

Audioplayers by amarok 574 comments

I have compilation Problem on my SlackWare 10.2.
This is tyhe compiler's Output.

error : Entity 'amarok-mianownik' not defined
>Krótki przewodnik po programie &amarok-mianownik;
^doc/nl'
quick.docbook:6: parser error : Entity 'amarok-mianownik' not defined
systenta pierwszego uruchomienia, który pokazuje siÄ, kiedy &amarok-mianownik;
^
quick.docbook:6: parser error : Entity 'amarok-biernik' not definedned
ewodnik po programie. Pomoże Ci on uruchomiÄ i skonfigurowaÄ &amarok-biernik;
^
quick.docbook:23: parser error : Entity 'amarok-dopelniacz' not defined
ie wÅasnych kolekcji jest jednÄ z najważniejszych funkcji &amarok-dopelniacz;
^
quick.docbook:81: parser error : Entity 'amarok-mianownik' not defined
rzane poprzez dodanie ich do przeglÄdarki listy odtwarzania. &amarok-mianownik;
^
quick.docbook:128: parser error : Entity 'amarok-dopelniacz' not defined
>Nagrywanie pÅyt audio CD jest Åatwe dziÄki integracji &amarok-dopelniacz; z
^
quick.docbook:146: parser error : chunk is not well balanced

^
index.docbook:178: parser error : Failure to process entity amarok-quick
&amarok-quick;
^
index.docbook:178: parser error : Entity 'amarok-quick' not defined
&amarok-quick;
^
index.docbook:504: parser error : Entity 'amarok-mianownik' not defined
>Jak zdobyÄ program &amarok-mianownik;
^
index.docbook:507: parser error : Entity 'amarok-mianownik' not defined
>&amarok-mianownik; może zostaÄ pobrany stÄd Jak skompilowaÄ &amarok-dopelniacz;
^
index.docbook:537: parser error : Entity 'amarok-mianownik' not defined
>Ponieważ &amarok-mianownik; wykorzystuje narzÄdzia W trakcie kompilacji &amarok-dopelniacz;, tak jak ma to miejsce w przypadku inn
^
index.docbook:588: parser error : Entity 'amarok-dopelniacz' not defined
> jeÅi zamierzasz wspomagaÄ rozwój &amarok-dopelniacz;.
^
index.docbook:597: parser error : Entity 'amarok-mianownik' not defined
>WÅÄcza obsÅugÄ bazy danych MySql w programie &amarok-mianownik;
^
index.docbook:606: parser error : Entity 'amarok-mianownik' not defined
>WyÅÄcza obsÅugÄ pobierania okÅadek z Amazon w programie &amarok-mianownik;
^
index.docbook:615: parser error : Entity 'amarok-mianownik' not defined
>WyÅÄcza obsÅugÄ aRts w programie &amarok-mianownik;
^
index.docbook:624: parser error : Entity 'amarok-mianownik' not defined
>WyÅÄcza obsÅugÄ GStreamer w programie &amarok-mianownik;
^
index.docbook:633: parser error : Entity 'amarok-mianownik' not defined
>WÅÄcza obsÅugÄ silnika Helix w programie &amarok-mianownik;
^
index.docbook:642: parser error : Entity 'amarok-mianownik' not defined
>WyÅÄcza obsÅugÄ xine w programie &amarok-mianownik;
^
index.docbook:651: parser error : Entity 'amarok-mianownik' not defined
>WÅÄcza obsÅugÄ NMM w programie &amarok-mianownik;
^
index.docbook:660: parser error : Entity 'amarok-mianownik' not defined
>WÅÄcza obsÅugÄ MAS w programie &amarok-mianownik;
^
index.docbook:669: parser error : Entity 'amarok-mianownik' not defined
>WyÅÄcza obsÅugÄ OpenGL (analizator) w programie &amarok-mianownik;
^
make[3]: *** [index.cache.bz2] Error 1
make[3]: Leaving directory `/tmp/amarok-1.4.1-beta1/doc/pl'
make[2]: *** [all-recursive] Error 1
make[2]: Leaving directory `/tmp/amarok-1.4.1-beta1/doc'
make[1]: *** [all-recursive] Error 1
make[1]: Leaving directory `/tmp/amarok-1.4.1-beta1'
- Jun 21 2006
TorK

Network by hoganrobert 85 comments

Yes i have Kde 3.4.2 the default on SlackWare 10.2! Thank's for help! - Jun 21 2006
TorK

Network by hoganrobert 85 comments

ake[2]: Entering directory `/tmp/tork-0.03/src'
if i486-slackware-linux-g++ -DHAVE_CONFIG_H -I. -I. -I.. -I/opt/kde/include -I/usr/lib/qt/include -I/usr/X11R6/include -DQT_THREAD_SUPPORT -D_REENTRANT -Wnon-virtual-dtor -Wno-long-long -Wundef -Wall -W -Wpointer-arith -Wwrite-strings -ansi -D_XOPEN_SOURCE=500 -D_BSD_SOURCE -Wcast-align -Wconversion -Wchar-subscripts -DNDEBUG -DNO_DEBUG -O2 -Wformat-security -Wmissing-format-attribute -fno-exceptions -fno-check-new -fno-common -MT tork.o -MD -MP -MF ".deps/tork.Tpo" -c -o tork.o tork.cpp; \
then mv -f ".deps/tork.Tpo" ".deps/tork.Po"; else rm -f ".deps/tork.Tpo"; exit 1; fi
tork.cpp: In member function `void tork::showWarning(display_status_t&, const
QString&, const QString&, const QString&)':
tork.cpp:1172: error: no matching function for call to `KPassivePopup::show(
QPoint)'
/opt/kde/include/kpassivepopup.h:195: error: candidates are: virtual void
KPassivePopup::show()
tork.cpp: In member function `void tork::askQuestion(display_status_t&, const
QString&, const QString&, const QString&, const QString&, void (tork::*)())
':
tork.cpp:1236: error: no matching function for call to `KPassivePopup::show(
QPoint)'
/opt/kde/include/kpassivepopup.h:195: error: candidates are: virtual void
KPassivePopup::show()
make[2]: *** [tork.o] Error 1
make[2]: Leaving directory `/tmp/tork-0.03/src'
make[1]: *** [install-recursive] Error 1
make[1]: Leaving directory `/tmp/tork-0.03/src'
make: *** [install-recursive] Error 1
- Jun 20 2006
Ts2Dvd

Video Apps by jancerny 47 comments

I try to Change the default Language, but it still remain in Czech maybe!
Only in the compilation directory it work! - Jun 15 2006
Picoxine

Utilities by ciaraan 25 comments

A SlackWare TGz package with SlackBuild Script is Ready to DownLoad!!!

http://www.slacky.it/

http://www.slacky.it/index.php?option=com_remository&Itemid=29&func=fileinfo&id=1199 - Jun 14 2006
PG Calculator

Science by gridniew 45 comments

A SlackWare TGz package with SlackBuild Script is Ready to DownLoad!!!

http://www.slacky.it/

http://www.slacky.it/index.php?option=com_remository&Itemid=29&func=fileinfo&id=1196 - Jun 14 2006
Wired

Audio Apps by jce 28 comments

A SlackWare TGz package with SlackBuild Script is Ready to DownLoad!!!

http://www.slacky.it/

http://www.slacky.it/index.php?option=com_remository&Itemid=29&func=fileinfo&id=1198 - Jun 14 2006
soniK

Audio Apps by tenfoot 19 comments

A SlackWare TGz package with SlackBuild Script is Ready to DownLoad!!!

http://www.slacky.it/


http://www.slacky.it/index.php?option=com_remository&Itemid=29&func=fileinfo&id=1067 - Jun 11 2006
abakus

Utilities by pynm0001 15 comments

A SlackWare TGz package with SlackBuild Script is Ready to DownLoad!!!

http://www.slacky.it/


http://www.slacky.it/index.php?option=com_remository&Itemid=1&func=fileinfo&filecatid=1132&parent=category - May 10 2006
KatchTV

TV & Streaming by jel 81 comments

A SlackWare TGz package with SlackBuild Script is Ready to DownLoad!!!

http://www.slacky.it/

http://www.slacky.it/index.php?option=com_remository&Itemid=1&func=fileinfo&filecatid=1117&parent=category - May 07 2006
Gamefu

Emulation by DarkShock 17 comments

A SlackWare TGz package with SlackBuild Script is Ready to DownLoad!!!

http://www.slacky.it/


http://www.slacky.it/index.php?option=com_remository&Itemid=1&func=fileinfo&filecatid=1112&parent=category - May 07 2006
Gamefu

Emulation by DarkShock 17 comments

May be the desktop file entry is wrong.

I correct it game and non games
Kamefu work good also in Kde 3.4

This is my desktop file

[Desktop Entry]
Encoding=UTF-8
Name=kamefu
Name[xx]=xxkamefuxx
Exec=kamefu
Icon=package_games
Type=Application
Comment=Kamefu - KDE All-Machine Emulator Frontend for UNIX
Comment[bg]=Kamefu - KDE All-Machine Emulator Frontend за UNIX
Comment[da]=Kamefu - KDE's grænseflade for emulering af alle maskiner i UNIX
Comment[es]=Kamefu - Interfaz de emulación para cualquier máquina UNIX
Comment[gl]=Kamefu - Interface KDE de Emulador Universal para UNIX
Comment[nl]=Kamefu - Emulator-frontend voor KDE
Comment[it]=Kamefu - Emulatore di Giochi per KDE
Comment[pt]=Kamefu - Interface de Emulador para Todas as Máquinas do KDE
Comment[pt_BR]=Kamefu - Interface de Emulador para Todas as Máquinas do KDE
Comment[sr]=Kamefu - KDE-ово ли - May 04 2006
Twinkle

Telephony by mfnboer 44 comments

A SlackWare TGz package with SlackBuild Script is Ready to DownLoad!!!

http://www.slacky.it/

http://www.slacky.it/index.php?option=com_remository&Itemid=1&func=fileinfo&filecatid=628&parent=category - May 03 2006
Kim (Kde Image Menu)

Graphic Apps by cbouveyron 197 comments

http://www.slacky.it/index.php?option=com_remository&Itemid=1&func=fileinfo&filecatid=1014&parent=category - May 02 2006
Slackware_kbfx_theme:)

Kbfx Startmenu by aut182 1 comment

Cool Work I Like too much!! :D - May 01 2006
Klearlook

KDE 3.5 Themes by p3001ee 58 comments

A SlackWare TGz package with SlackBuild Script is Ready to DownLoad!!!

http://www.slacky.it/

http://www.slacky.it/index.php?option=com_remository&Itemid=1&func=fileinfo&filecatid=1092&parent=category - May 01 2006
Serenity

KDE 3.5 Themes by Maxilys 251 comments

A SlackWare TGz package with SlackBuild Script is Ready to DownLoad!!!

http://www.slacky.it/

http://www.slacky.it/index.php?option=com_remository&Itemid=1&func=fileinfo&filecatid=1094&parent=category - May 01 2006
Twinkle

Telephony by mfnboer 44 comments

I have the 1.3.26 version! - Apr 30 2006
Twinkle

Telephony by mfnboer 44 comments

With the last versione Twinkle have compilation problem with my SlackWare 10.2.
The compilation LOg:

make[3]: Entering directory `/tmp/twinkle-0.7/src/audio/gsm'
make[4]: Entering directory `/tmp/twinkle-0.7/src/audio/gsm'
make[4]: Nothing to be done for `install-exec-am'.
make[4]: Nothing to be done for `install-data-am'.
make[4]: Leaving directory `/tmp/twinkle-0.7/src/audio/gsm'
make[3]: Leaving directory `/tmp/twinkle-0.7/src/audio/gsm'
make[3]: Entering directory `/tmp/twinkle-0.7/src/audio'
if i486-slackware-linux-g++ -DHAVE_CONFIG_H -I. -I. -I../../src -I ../../src -I /usr/include -DQT_THREAD_SUPPORT -D_REENTRANT -O2 -march=i486 -mcpu=i686 -I/usr/include/cc++2 -D_GNU_SOURCE -MT twinkle_rtp_session.o -MD -MP -MF ".deps/twinkle_rtp_session.Tpo" -c -o twinkle_rtp_session.o twinkle_rtp_session.cpp; \
then mv -f ".deps/twinkle_rtp_session.Tpo" ".deps/twinkle_rtp_session.Po"; else rm -f ".deps/twinkle_rtp_session.Tpo"; exit 1; fi
In file included from /usr/include/ccrtp/queuebase.h:47,
from /usr/include/ccrtp/iqueue.h:47,
from /usr/include/ccrtp/ioqueue.h:47,
from /usr/include/ccrtp/cqueue.h:47,
from /usr/include/ccrtp/rtp.h:52,
from twinkle_rtp_session.h:5,
from twinkle_rtp_session.cpp:1:
/usr/include/cc++2/cc++/pointer.h:56: error: syntax error before `{' token
/usr/include/cc++2/cc++/pointer.h:59: error: syntax error before `*' token
/usr/include/cc++2/cc++/pointer.h: In function `void ost::ptrDetach()':
/usr/include/cc++2/cc++/pointer.h:63: error: `ptrCount' undeclared (first use
this function)
/usr/include/cc++2/cc++/pointer.h:63: error: (Each undeclared identifier is
reported only once for each function it appears in.)
/usr/include/cc++2/cc++/pointer.h:65: error: `ptrObject' undeclared (first use
this function)
/usr/include/cc++2/cc++/pointer.h: At global scope:
/usr/include/cc++2/cc++/pointer.h:72: error: syntax error before `public'
/usr/include/cc++2/cc++/pointer.h:76: error: `int*ost::ptrCount' used prior to
declaration
/usr/include/cc++2/cc++/pointer.h:76: error: invalid conversion from `int' to `
int*'
/usr/include/cc++2/cc++/pointer.h:79: error: `T' was not declared in this scope
/usr/include/cc++2/cc++/pointer.h:79: error: syntax error before `&' token
/usr/include/cc++2/cc++/pointer.h: In function `int Pointer(...)':
/usr/include/cc++2/cc++/pointer.h:81: error: `ptrObject' undeclared (first use
this function)
/usr/include/cc++2/cc++/pointer.h:81: error: `ref' undeclared (first use this
function)
/usr/include/cc++2/cc++/pointer.h:82: error: `ptrCount' undeclared (first use
this function)
/usr/include/cc++2/cc++/pointer.h: At global scope:
/usr/include/cc++2/cc++/pointer.h:87: error: destructors must be member
functions
/usr/include/cc++2/cc++/pointer.h:87: error: virtual outside class declaration
/usr/include/cc++2/cc++/pointer.h: In function `void Pointer()':
/usr/include/cc++2/cc++/pointer.h:88: error: `ptrDetach' undeclared (first use
this function)
/usr/include/cc++2/cc++/pointer.h: At global scope:
/usr/include/cc++2/cc++/pointer.h:92: error: syntax error before `&' token
/usr/include/cc++2/cc++/pointer.h:97: error: `int ptrObject' used prior to
declaration
/usr/include/cc++2/cc++/pointer.h:98: error: `int ptrCount' used prior to
declaration
/usr/include/cc++2/cc++/pointer.h:99: error: syntax error before `++' token
/usr/include/cc++2/cc++/pointer.h:104: error: syntax error before `&' token
/usr/include/cc++2/cc++/pointer.h:107: error: syntax error before `*' token
/usr/include/cc++2/cc++/pointer.h:110: error: syntax error before `*' token
/usr/include/cc++2/cc++/pointer.h:114: error: non-member function `bool
operator!()' cannot have `const' method qualifier
/usr/include/cc++2/cc++/pointer.h:114: error: `bool operator!()' must have an
argument of class or enumerated type
/usr/include/cc++2/cc++/pointer.h:114: error: `bool operator!()' must take
exactly one argument
/usr/include/cc++2/cc++/pointer.h: In function `bool operator!()':
/usr/include/cc++2/cc++/pointer.h:114: error: invalid type argument of `unary *
'
/usr/include/cc++2/cc++/pointer.h: At global scope:
/usr/include/cc++2/cc++/pointer.h:117: error: non-member function `int
operator++()' cannot have `const' method qualifier
/usr/include/cc++2/cc++/pointer.h:117: error: `int operator++()' must have an
argument of class or enumerated type
/usr/include/cc++2/cc++/pointer.h:117: error: `int operator++()' must take
either one or two arguments
/usr/include/cc++2/cc++/pointer.h: In function `int operator++()':
/usr/include/cc++2/cc++/pointer.h:117: error: invalid type argument of `unary *
'
/usr/include/cc++2/cc++/pointer.h: At global scope:
/usr/include/cc++2/cc++/pointer.h:120: error: non-member function `int
operator--()' cannot have `const' method qualifier
/usr/include/cc++2/cc++/pointer.h:120: error: `int operator--()' must have an
argument of class or enumerated type
/usr/include/cc++2/cc++/pointer.h:120: error: `int operator--()' must take
either one or two arguments
/usr/include/cc++2/cc++/pointer.h: In function `int operator--()':
/usr/include/cc++2/cc++/pointer.h:121: error: invalid type argument of `unary *
'
/usr/include/cc++2/cc++/pointer.h:123: error: invalid use of `this' in
non-member function
/usr/include/cc++2/cc++/pointer.h:126: error: invalid type argument of `unary *
'
/usr/include/cc++2/cc++/pointer.h: At global scope:
/usr/include/cc++2/cc++/pointer.h:128: error: syntax error before `}' token
In file included from /usr/include/ccrtp/iqueue.h:47,
from /usr/include/ccrtp/ioqueue.h:47,
from /usr/include/ccrtp/cqueue.h:47,
from /usr/include/ccrtp/rtp.h:52,
from twinkle_rtp_session.h:5,
from twinkle_rtp_session.cpp:1:
/usr/include/ccrtp/queuebase.h:158: error: 'Pointer' is used as a type, but is
not defined as a type.
/usr/include/ccrtp/queuebase.h: In member function `PayloadType
ost::AppDataUnit::getType() const':
/usr/include/ccrtp/queuebase.h:98: error: `datablock' undeclared (first use
this function)
make[3]: *** [twinkle_rtp_session.o] Error 1
make[3]: Leaving directory `/tmp/twinkle-0.7/src/audio'
make[2]: *** [install-recursive] Error 1
make[2]: Leaving directory `/tmp/twinkle-0.7/src/audio'
make[1]: *** [install-recursive] Error 1
make[1]: Leaving directory `/tmp/twinkle-0.7/src'
make: *** [install-recursive] Error 1 - Apr 30 2006
Serenity

KDE 3.5 Themes by Maxilys 251 comments

Compilation Problem with my SlackWare 10.2.
Serenity.Style compile good. But Serenity.decoration no.
This is the log

make[3]: Leaving directory `/tmp/serenity.decoration-0.6/serenityclient/config'
make[3]: Entering directory `/tmp/serenity.decoration-0.6/serenityclient'
source='serenityclient.cpp' object='serenityclient.lo' libtool=yes \
depfile='.deps/serenityclient.Plo' tmpdepfile='.deps/serenityclient.TPlo' \
depmode=gcc3 /bin/sh ../admin/depcomp \
/bin/sh ../libtool --silent --mode=compile --tag=CXX i486-slackware-linux-g++ -DHAVE_CONFIG_H -I. -I. -I.. -I/opt/kde/include -I/usr/lib/qt/include -I/usr/X11R6/include -I/opt/kde/include/kwin -DQT_THREAD_SUPPORT -D_REENTRANT -Wnon-virtual-dtor -Wno-long-long -Wundef -Wall -pedantic -W -Wpointer-arith -Wwrite-strings -ansi -D_XOPEN_SOURCE=500 -D_BSD_SOURCE -Wcast-align -Wconversion -Wchar-subscripts -DNDEBUG -DNO_DEBUG -O2 -O2 -march=i486 -mcpu=i686 -Wformat-security -Wmissing-format-attribute -fno-exceptions -fno-check-new -fno-common -DQT_PLUGIN -c -o serenityclient.lo `test -f 'serenityclient.cpp' || echo './'`serenityclient.cpp
serenityclient.cpp: In member function `void
SerenityClient::wheelEvent(QWheelEvent*)':
serenityclient.cpp:442: error: `titlebarMouseWheelOperation' undeclared (first
use this function)
serenityclient.cpp:442: error: (Each undeclared identifier is reported only
once for each function it appears in.)
make[3]: *** [serenityclient.lo] Error 1
make[3]: Leaving directory `/tmp/serenity.decoration-0.6/serenityclient'
make[2]: *** [all-recursive] Error 1
make[2]: Leaving directory `/tmp/serenity.decoration-0.6/serenityclient'
make[1]: *** [all-recursive] Error 1
make[1]: Leaving directory `/tmp/serenity.decoration-0.6'
make: *** [all] Error 2
Making install in serenityclient
make[1]: Entering directory `/tmp/serenity.decoration-0.6/serenityclient'
Making install in config
make[2]: Entering directory `/tmp/serenity.decoration-0.6/serenityclient/config'
make[3]: Entering directory `/tmp/serenity.decoration-0.6/serenityclient/config'
/bin/sh ../../admin/mkinstalldirs /tmp/package-serenity.decoration/opt/kde/lib/kde3
mkdir -p -- /tmp/package-serenity.decoration/opt/kde/lib/kde3
/bin/sh ../../libtool --silent --mode=install /usr/bin/ginstall -c -p kwin_serenity_config.la /tmp/package-serenity.decoration/opt/kde/lib/kde3/kwin_serenity_config.la
libtool: install: warning: remember to run `libtool --finish /opt/kde/lib/kde3'
make[3]: Nothing to be done for `install-data-am'.
make[3]: Leaving directory `/tmp/serenity.decoration-0.6/serenityclient/config'
make[2]: Leaving directory `/tmp/serenity.decoration-0.6/serenityclient/config'
make[2]: Entering directory `/tmp/serenity.decoration-0.6/serenityclient'
source='serenityclient.cpp' object='serenityclient.lo' libtool=yes \
depfile='.deps/serenityclient.Plo' tmpdepfile='.deps/serenityclient.TPlo' \
depmode=gcc3 /bin/sh ../admin/depcomp \
/bin/sh ../libtool --silent --mode=compile --tag=CXX i486-slackware-linux-g++ -DHAVE_CONFIG_H -I. -I. -I.. -I/opt/kde/include -I/usr/lib/qt/include -I/usr/X11R6/include -I/opt/kde/include/kwin -DQT_THREAD_SUPPORT -D_REENTRANT -Wnon-virtual-dtor -Wno-long-long -Wundef -Wall -pedantic -W -Wpointer-arith -Wwrite-strings -ansi -D_XOPEN_SOURCE=500 -D_BSD_SOURCE -Wcast-align -Wconversion -Wchar-subscripts -DNDEBUG -DNO_DEBUG -O2 -O2 -march=i486 -mcpu=i686 -Wformat-security -Wmissing-format-attribute -fno-exceptions -fno-check-new -fno-common -DQT_PLUGIN -c -o serenityclient.lo `test -f 'serenityclient.cpp' || echo './'`serenityclient.cpp
serenityclient.cpp: In member function `void
SerenityClient::wheelEvent(QWheelEvent*)':
serenityclient.cpp:442: error: `titlebarMouseWheelOperation' undeclared (first
use this function)
serenityclient.cpp:442: error: (Each undeclared identifier is reported only
once for each function it appears in.)
make[2]: *** [serenityclient.lo] Error 1
make[2]: Leaving directory `/tmp/serenity.decoration-0.6/serenityclient'
make[1]: *** [install-recursive] Error 1
make[1]: Leaving directory `/tmp/serenity.decoration-0.6/serenityclient'
make: *** [install-recursive] Error 1 - Apr 30 2006
KBFX Silk (KBFX 0.4.9.3.1)

Various KDE 1.-4. Improvements by sirajr 613 comments

A SlackWare TGz package with SlackBuild Script is Ready to DownLoad!!!

http://www.slacky.it/

http://www.slacky.it/index.php?option=com_remository&Itemid=1&func=fileinfo&filecatid=1086&parent=category - Apr 27 2006
soniK

Audio Apps by tenfoot 19 comments

A SlackWare TGz package with SlackBuild Script is Ready to DownLoad!!!

http://www.slacky.it/

http://www.slacky.it/index.php?option=com_remository&Itemid=1&func=fileinfo&filecatid=1085&parent=category - Apr 26 2006
KBFX Silk (KBFX 0.4.9.3.1)

Various KDE 1.-4. Improvements by sirajr 613 comments

The Make install build a directory /crystalsvg near root directory?
And the same in the good place
/opt/kde/share/icons/crystalsvg/
- Apr 25 2006
KoverArtist

Utilities by StefanT 175 comments

A SlackWare TGz package with SlackBuild Script is Ready to DownLoad!!!

http://www.slacky.it/


http://www.slacky.it/index.php?option=com_remository&Itemid=1&func=fileinfo&filecatid=1075&parent=category - Apr 25 2006
KoverArtist

Utilities by StefanT 175 comments

A SlackWare TGz package with SlackBuild Script is Ready to DownLoad!!!

http://www.slacky.it/

A SlackWare TGz package with SlackBuild Script is Ready to DownLoad!!!

http://www.slacky.it/ - Apr 25 2006
KBFX Silk (KBFX 0.4.9.3.1)

Various KDE 1.-4. Improvements by sirajr 613 comments

Thank's :D - Apr 25 2006
KTouch

Education Apps by ghorwin 3 comments

A SlackWare TGz package with SlackBuild Script is Ready to DownLoad!!!

http://www.slacky.it/


http://www.slacky.it/index.php?option=com_remository&Itemid=1&func=fileinfo&filecatid=1078&parent=category - Apr 25 2006
KTouch

Education Apps by ghorwin 3 comments

A SlackWare TGz package with SlackBuild Script is Ready to DownLoad!!!

http://www.slacky.it/


http://www.slacky.it/index.php?option=com_remository&Itemid=1&func=fileinfo&filecatid=1078&parent=category - Apr 25 2006
KRunning

Database by Jakarta 8 comments

A SlackWare TGz package with SlackBuild Script is Ready to DownLoad!!!

http://www.slacky.it/

http://www.slacky.it/index.php?option=com_remository&Itemid=1&func=fileinfo&filecatid=1079&parent=category - Apr 25 2006
koast - system configuration module

Various KDE 1.-4. Improvements by udev 10 comments

Compilation Problem on my Slackware 10.2

make[1]: Entering directory `/tmp/koast-0.1/src'
if /bin/sh ../libtool --silent --tag=CXX --mode=compile i486-slackware-linux-g++ -DHAVE_CONFIG_H -I. -I. -I.. -I/opt/kde/include -I/usr/lib/qt/include -I/usr/X11R6/include -DQT_THREAD_SUPPORT -D_REENTRANT -Wnon-virtual-dtor -Wno-long-long -Wundef -Wall -W -Wpointer-arith -Wwrite-strings -ansi -D_XOPEN_SOURCE=500 -D_BSD_SOURCE -Wcast-align -Wconversion -Wchar-subscripts -DNDEBUG -DNO_DEBUG -O2 -O2 -march=i486 -mcpu=i686 -Wformat-security -Wmissing-format-attribute -fno-exceptions -fno-check-new -fno-common -MT koast.lo -MD -MP -MF ".deps/koast.Tpo" -c -o koast.lo koast.cpp; \
then mv -f ".deps/koast.Tpo" ".deps/koast.Plo"; else rm -f ".deps/koast.Tpo"; exit 1; fi
In file included from koast.cpp:41:
listloader.h:71: error: 'uintptr_t' is used as a type, but is not defined as a
type.
koast.cpp: In member function `void Koast::slot_listViewChanged(bool)':
koast.cpp:205: warning: unused parameter `bool state'
koast.cpp: In member function `void Koast::m_loadFile(const char*)':
koast.cpp:288: warning: unused variable `STObject*pObj'
make[1]: *** [koast.lo] Error 1
make[1]: Leaving directory `/tmp/koast-0.1/src'
make: *** [install-recursive] Error 1
- Apr 22 2006
KoverArtist

Utilities by StefanT 175 comments

Ok now compile good!! Nice work!!:D - Apr 22 2006