Image 01
profile-image

harryzZz

arrigo razzini
Kicker Pager

Various KDE 1.-4. Improvements by epoch 103 comments

I trying to compile your app on kde 3.1.4 but the compilation fail :

In file included from desktop.cpp:26:
kpager.h:55: error: syntax error before `*' token
kpager.h:100: error: `WindowInfo' is not a member of type `KWin'
.....
desktop.cpp: At global scope:
desktop.cpp:384: error: `WindowInfo' is not a member of type `KWin'
desktop.cpp:385: error: `bool Desktop::shouldPaintWindow' is not a static
member of `class Desktop'
desktop.cpp:385: error: syntax error before `{' token
desktop.cpp:392: error: `NormalMask' is not a member of type `NET'
desktop.cpp:393: error: `DesktopMask' is not a member of type `NET'
desktop.cpp:393: error: `DockMask' is not a member of type `NET'
desktop.cpp:393: error: `ToolbarMask' is not a member of type `NET'
desktop.cpp:393: error: `MenuMask' is not a member of type `NET'
desktop.cpp:394: error: `DialogMask' is not a member of type `NET'
desktop.cpp:394: error: `OverrideMask' is not a member of type `NET'
desktop.cpp:394: error: `TopMenuMask' is not a member of type `NET'
desktop.cpp:394: error: `UtilityMask' is not a member of type `NET'
desktop.cpp:394: error: `SplashMask' is not a member of type `NET'
......
make[2]: *** [desktop.lo] Error 1
make[2]: Leaving directory `/home/razzo/kickerpager-0.3.1/src'
make[1]: *** [all-recursive] Error 1
make[1]: Leaving directory `/home/razzo/kickerpager-0.3.1'
make: *** [all] Error 2

Does it compile only on kde 3.2.x ? - Apr 08 2004
MountISO

Dolphin Service Menus by prjanique 305 comments

A very useful menu , but why not extend it also for .nrg images ?

This images are very common , and too much people (in particular newbie) that uses linux dont'know how to treat.

mount -t iso9660 -o loop,offset=307200 image.nrg mount_point/

What do you think ? - Mar 31 2004
KMameleon

Various Games by stormchaser 4 comments

it should be a good alternative to qtmame , but doesn't compile .
This is the output of make on a suse 9 system :

razzo@linux:~/kmameleon-1.0> make
make all-recursive
make[1]: Entering directory `/home/razzo/kmameleon-1.0'
Making all in images
make[2]: Entering directory `/home/razzo/kmameleon-1.0/images'
make[2]: Nothing to be done for `all'.
make[2]: Leaving directory `/home/razzo/kmameleon-1.0/images'
Making all in main
make[2]: Entering directory `/home/razzo/kmameleon-1.0/main'
/usr/lib/qt3/bin/uic -L /opt/kde3/lib/kde3/plugins/designer -nounload -o kmmifacedlg.h ./kmmifacedlg.ui
/usr/lib/qt3/bin/uic -L /opt/kde3/lib/kde3/plugins/designer -nounload -o dlgdebug.h ./dlgdebug.ui
/usr/lib/qt3/bin/moc ./mainwindow.h -o mainwindow.moc
if g++ -DHAVE_CONFIG_H -I. -I. -I.. -I../tools/romchecker -I./../tools/romchecker -I../tools/pathfinder -I./../tools/pathfinder -I../tools/romlister -I./../tools/romlister -I../widgets/ -I./../widgets -I/opt/kde3/include -I/usr/lib/qt3/include -I/usr/X11R6/include -DQT_THREAD_SUPPORT -D_REENTRANT -Wnon-virtual-dtor -Wno-long-long -Wundef -Wall -pedantic -W -Wpointer-arith -Wwrite-strings -ansi -D_XOPEN_SOURCE=500 -D_BSD_SOURCE -Wcast-align -Wconversion -Wchar-subscripts -O2 -Wformat-security -Wmissing-format-attribute -fno-exceptions -fno-check-new -fno-common -MT mainwindow.o -MD -MP -MF ".deps/mainwindow.Tpo" \
-c -o mainwindow.o `test -f 'mainwindow.cc' || echo './'`mainwindow.cc; \
then mv -f ".deps/mainwindow.Tpo" ".deps/mainwindow.Po"; \
else rm -f ".deps/mainwindow.Tpo"; exit 1; \
fi
In file included from mainwindow.h:51,
from mainwindow.cc:16:
../tools/romchecker/toolromchecker.h:41:33: toolromcheckeriface.h: No such file or directory
In file included from mainwindow.h:51,
from mainwindow.cc:16:
../tools/romchecker/toolromchecker.h:44: error: parse error before `{' token
../tools/romchecker/toolromchecker.h:45: error: virtual outside class
declaration
../tools/romchecker/toolromchecker.h:45: error: non-member function `const
char* className()' cannot have `const' method qualifier
../tools/romchecker/toolromchecker.h:45: error: virtual outside class
declaration
../tools/romchecker/toolromchecker.h:45: error: virtual outside class
declaration
../tools/romchecker/toolromchecker.h:45: error: virtual outside class
declaration
../tools/romchecker/toolromchecker.h:45: error: virtual outside class
declaration
../tools/romchecker/toolromchecker.h: In function `QObject* qObject()':
../tools/romchecker/toolromchecker.h:45: error: invalid use of `this' in
non-member function
../tools/romchecker/toolromchecker.h: At global scope:
../tools/romchecker/toolromchecker.h:45: error: parse error before `private'
../tools/romchecker/toolromchecker.h:48: error: destructors must be member
functions
../tools/romchecker/toolromchecker.h:50: error: parse error before `private'
../tools/romchecker/toolromchecker.h:69: error: parse error before `private'
../tools/romchecker/toolromchecker.h:75: error: parse error before `}' token
In file included from mainwindow.h:52,
from mainwindow.cc:16:
../tools/pathfinder/toolpathfinder.h:38:33: toolpathfinderiface.h: No such file or directory
In file included from mainwindow.h:52,
from mainwindow.cc:16:
../tools/pathfinder/toolpathfinder.h:41: error: parse error before `{' token
../tools/pathfinder/toolpathfinder.h:42: error: virtual outside class
declaration
../tools/pathfinder/toolpathfinder.h:42: error: non-member function `const
char* className()' cannot have `const' method qualifier
../tools/pathfinder/toolpathfinder.h:42: error: virtual outside class
declaration
../tools/pathfinder/toolpathfinder.h:42: error: virtual outside class
declaration
../tools/pathfinder/toolpathfinder.h:42: error: virtual outside class
declaration
../tools/pathfinder/toolpathfinder.h:42: error: virtual outside class
declaration
../tools/pathfinder/toolpathfinder.h: In function `QObject* qObject()':
../tools/pathfinder/toolpathfinder.h:42: error: redefinition of `QObject*
qObject()'
../tools/romchecker/toolromchecker.h:45: error: `QObject* qObject()' previously
defined here
../tools/pathfinder/toolpathfinder.h:42: error: redefinition of `QObject*
qObject()'
../tools/romchecker/toolromchecker.h:45: error: `QObject* qObject()' previously
defined here
../tools/pathfinder/toolpathfinder.h:42: error: invalid use of `this' in
non-member function
../tools/pathfinder/toolpathfinder.h: At global scope:
../tools/pathfinder/toolpathfinder.h:42: warning: default argument given for
parameter 2 of `QString tr(const char*, const char*)'
../tools/romchecker/toolromchecker.h:45: warning: after previous specification
in `QString tr(const char*, const char*)'
../tools/pathfinder/toolpathfinder.h:42: warning: default argument given for
parameter 2 of `QString trUtf8(const char*, const char*)'
../tools/romchecker/toolromchecker.h:45: warning: after previous specification
in `QString trUtf8(const char*, const char*)'
../tools/pathfinder/toolpathfinder.h:42: error: parse error before `private'
../tools/pathfinder/toolpathfinder.h:45: error: destructors must be member
functions
../tools/pathfinder/toolpathfinder.h:47: error: parse error before `private'
../tools/pathfinder/toolpathfinder.h:60: error: parse error before `private'
../tools/pathfinder/toolpathfinder.h:65: error: parse error before `}' token
In file included from mainwindow.h:53,
from mainwindow.cc:16:
../tools/romlister/toolromlister.h:44:32: toolromlisteriface.h: No such file or directory
In file included from mainwindow.h:53,
from mainwindow.cc:16:
../tools/romlister/toolromlister.h:47: error: parse error before `{' token
../tools/romlister/toolromlister.h:48: error: virtual outside class declaration
../tools/romlister/toolromlister.h:48: error: non-member function `const char*
className()' cannot have `const' method qualifier
../tools/romlister/toolromlister.h:48: error: virtual outside class declaration
../tools/romlister/toolromlister.h:48: error: virtual outside class declaration
../tools/romlister/toolromlister.h:48: error: virtual outside class declaration
../tools/romlister/toolromlister.h:48: error: virtual outside class declaration
../tools/romlister/toolromlister.h: In function `QObject* qObject()':
../tools/romlister/toolromlister.h:48: error: redefinition of `QObject*
qObject()'
../tools/pathfinder/toolpathfinder.h:42: error: `QObject* qObject()' previously
defined here
../tools/romlister/toolromlister.h:48: error: redefinition of `QObject*
qObject()'
../tools/pathfinder/toolpathfinder.h:42: error: `QObject* qObject()' previously
defined here
../tools/romlister/toolromlister.h:48: error: redefinition of `QObject*
qObject()'
../tools/romchecker/toolromchecker.h:45: error: `QObject* qObject()' previously
defined here
../tools/romlister/toolromlister.h:48: error: invalid use of `this' in
non-member function
../tools/romlister/toolromlister.h: At global scope:
../tools/romlister/toolromlister.h:48: warning: default argument given for
parameter 2 of `QString tr(const char*, const char*)'
../tools/pathfinder/toolpathfinder.h:42: warning: after previous specification
in `QString tr(const char*, const char*)'
../tools/romlister/toolromlister.h:48: warning: default argument given for
parameter 2 of `QString trUtf8(const char*, const char*)'
../tools/pathfinder/toolpathfinder.h:42: warning: after previous specification
in `QString trUtf8(const char*, const char*)'
../tools/romlister/toolromlister.h:48: error: parse error before `private'
../tools/romlister/toolromlister.h:51: error: destructors must be member
functions
../tools/romlister/toolromlister.h:55: error: redefinition of `KConfig*config'
../tools/pathfinder/toolpathfinder.h:56: error: `KConfig*config' previously
declared here
../tools/romlister/toolromlister.h:58: error: parse error before `private'
../tools/romlister/toolromlister.h:67: error: parse error before `private'
../tools/romlister/toolromlister.h:75: error: virtual outside class declaration
../tools/romlister/toolromlister.h:76: error: parse error before `}' token
In file included from mainwindow.cc:16:
mainwindow.h:77: error: syntax error before `*' token
mainwindow.h:78: error: syntax error before `*' token
mainwindow.h:79: error: syntax error before `*' token
mainwindow.cc: In constructor `KMameleon::KMameleon()':
mainwindow.cc:71: error: `romChecker' undeclared (first use this function)
mainwindow.cc:71: error: (Each undeclared identifier is reported only once for
each function it appears in.)
mainwindow.cc:71: error: parse error before `(' token
mainwindow.cc:72: error: `pathFinder' undeclared (first use this function)
mainwindow.cc:72: error: parse error before `(' token
mainwindow.cc:73: error: `romLister' undeclared (first use this function)
mainwindow.cc:73: error: parse error before `(' token
mainwindow.moc: At top level:
../tools/romlister/toolromlister.h:48: warning: `bool
qt_static_property(QObject*, int, int, QVariant*)' declared `static' but
never defined
../tools/romlister/toolromlister.h:48: warning: `QMetaObject*
staticMetaObject()' declared `static' but never defined
../tools/romlister/toolromlister.h:48: warning: `QString tr(const char*, const
char*)' declared `static' but never defined
../tools/romlister/toolromlister.h:48: warning: `QString trUtf8(const char*,
const char*)' declared `static' but never defined
make[2]: *** [mainwindow.o] Error 1
make[2]: Leaving directory `/home/razzo/kmameleon-1.0/main'
make[1]: *** [all-recursive] Error 1
make[1]: Leaving directory `/home/razzo/kmameleon-1.0'
make: *** [all] Error 2 - Mar 25 2004
Aethera

Groupware by BigBoss 8 comments

also I do not succeed !
bah ... - Jan 21 2004