Image 01
profile-image

kent57

Kent Johns
test
Very simple CPU temperature

Plasma 4 Extensions 3 comments

Score 67.1%
Mar 07 2010
Nice clean widget. Only one small issue widget resize is not saved. When the system is restarted size goes back to the default. - Aug 10 2011
ALSA Volume Control plasmoid

Plasma 4 Extensions 62 comments

by F1ash
Score 83.0%
Apr 01 2014
Thanks F1ash escape works fine. I think the problem is related to the fact I have dual monitors & I placed the widget too close to the upper left hand corner of the right hand monitor.
Great plasmoid solved a lot of issues I've been having with pulseaudio & alsamixer. - Mar 10 2011
Thanks F1ash escape works fine. I think the problem is related to the fact I have dual monitors & I placed the widget too close to the upper left hand corner of the right hand monitor.
Great plasmoid solved a lot of issues I've been having with pulseaudio & alsamixer. - Mar 10 2011
Tried the update but no success.
Tried bartman2589 repackaging idea & it worked.
However the "on Icon" selection in the set-up gives a window that shows all outputs but can't close the window because it covers the icon that closes it. - Mar 09 2011
After installing as per instructions, any use of plasmoid crashes plasma-desktop. Configuring plasmoid crashes desktop and even closing plasmoid crashes desktop. Have followed all discussions above with no success.
Any suggestions? - Mar 07 2011
Xeo Icons Theme for Karmic Koala

Full Icon Themes 5 comments

Score 50.0%
Oct 30 2009
FIXED - Inserting ';;' eliminates "syntax error near unexpected token `)'". Error caused by line 266 ";;" missing after "done" as reported by mauriciochicas. - Nov 15 2009
Still get error:
./change-type.sh: line 282: syntax error near unexpected token `)'
./change-type.sh: line 282: ` oxyacquamarinefolder)' - Nov 15 2009
./change-type.sh oxyacquamarinefolder
returns line 282: syntax error near unexpected token `)' - Nov 14 2009
Customizable Weather Plasmoid (CWP)

Plasma 4 Extensions 1069 comments

Score 84.7%
Sep 02 2017
Is there a way to save the CWP configuration. Every time the plasmoid is updated to the latest release I have to reconfigure it. It would be nice If I could just reinstall a saved config.

Thanks - Oct 13 2009
Tasklist rotated in vertical panels

Plasma 4 Extensions 11 comments

Score 50.0%
May 25 2009
I get a similar error running 'make'

[ 85%] Building CXX object CMakeFiles/plasma_applet_tasks_vertical.dir/abstracttaskitem.o
/home/ian/Downloads/105287-tasks_vertical/abstracttaskitem.cpp: In member function ‘virtual void AbstractTaskItem::hoverLeaveEvent(QGraphicsSceneHoverEvent*)’:
/home/ian/Downloads/105287-tasks_vertical/abstracttaskitem.cpp:307: error: ‘Atom’ was not declared in this scope
/home/ian/Downloads/105287-tasks_vertical/abstracttaskitem.cpp:307: error: expected `;' before ‘atom’
/home/ian/Downloads/105287-tasks_vertical/abstracttaskitem.cpp:308: error: ‘atom’ was not declared in this scope
/home/ian/Downloads/105287-tasks_vertical/abstracttaskitem.cpp:308: error: ‘XDeleteProperty’ was not declared in this scope
/home/ian/Downloads/105287-tasks_vertical/abstracttaskitem.cpp: In member function ‘virtual void AbstractTaskItem::timerEvent(QTimerEvent*)’:
/home/ian/Downloads/105287-tasks_vertical/abstracttaskitem.cpp:442: error: ‘Atom’ was not declared in this scope
/home/ian/Downloads/105287-tasks_vertical/abstracttaskitem.cpp:442: error: expected `;' before ‘atom’
/home/ian/Downloads/105287-tasks_vertical/abstracttaskitem.cpp:443: error: ‘atom’ was not declared in this scope
/home/ian/Downloads/105287-tasks_vertical/abstracttaskitem.cpp:443: error: ‘PropModeReplace’ was not declared in this scope
/home/ian/Downloads/105287-tasks_vertical/abstracttaskitem.cpp:444: error: ‘XChangeProperty’ was not declared in this scope
make[2]: *** [CMakeFiles/plasma_applet_tasks_vertical.dir/abstracttaskitem.o] Error 1
make[1]: *** [CMakeFiles/plasma_applet_tasks_vertical.dir/all] Error 2
make: *** [all] Error 2

Any suggestions to correct errors would be helpful
KDE 4.3 Kubuntu

- Jun 20 2009
ALSA Volume Control plasmoid

Plasma 4 Extensions
by F1ash

Score 83.0%
Mar 10 2011