KDM Theme Manager

Various KDE 1.-4. Improvements by smileaf 237 comments

kdmtheme-1.1-S10K351.i586.rpm
at
http://home.tiscali.be/raoul.linux/downloadSuSE10.0.htm


ENJOY !!! - Mar 24 2006
kradview

Graphic Apps by irbis 34 comments

Sorry for you
I have compiled Yakuake who is a KDE extra gear application without problem.

I think the problem is in the tarball package; - Mar 22 2006
kradview

Graphic Apps by irbis 34 comments

Hello David ,
I have automake at a level 1.9.6 .
It's not normal to to replace automake by a lowest level.
It's not a serious as solution - Mar 21 2006
kradview

Graphic Apps by irbis 34 comments

linux:/home/raoul/work/kradview-0.6.1 # make -f Makefile.cvs
This Makefile is only for the CVS repository
This will be deleted before making the distribution

*** YOU'RE USING automake (GNU automake) 1.9.6.
*** KDE requires automake 1.6
make[1]: *** [cvs] Erreur 1
make: *** [all] Erreur 2
linux:/home/raoul/work/kradview-0.6.1 #

On SuSE 10.0 KDE351 - Mar 21 2006
Yakuake

System Software by Sho 1026 comments

yakuake-2.7.4-S10K351.i586.rpm
at
http://home.tiscali.be/raoul.linux/downloadSuSE10.0.htm


ENJOY !!! - Mar 20 2006
k9copy

Utilities by jnmchlptt 244 comments

k9copy-1.0.4beta2-S10K351.i586.rpm
at
http://home.tiscali.be/raoul.linux/downloadSuSE10.0.htm


ENJOY !!! - Mar 16 2006
KPhotoBook

Graphic Apps by starcube 25 comments

I see you use Scons for your tarrball.
This solutions doesn't create an entry in Yast RPM database. It's not a good strategie for a linux system ....

With scons we cannot creta a RPM.
It's possible to have a classic tarball

For the newbies is better to use a RPM in place of scons procedure ( thinks at dos command for windows )

I think it's not a good promotion for linux system.. - Mar 15 2006
Kima - kicker monitoring applet

Various KDE 1.-4. Improvements by kenws 360 comments

cpuinfo-0.4.S10K351.i586.rpm
at
http://home.tiscali.be/raoul.linux/downloadSuSE10.0.htm - Mar 14 2006
Kopete

Chat & Messenging by mattr 100 comments

This product is not tested....

BAD....BAD....BAD - Mar 14 2006
Kima - kicker monitoring applet

Various KDE 1.-4. Improvements by kenws 360 comments

Suse 10.0 KDE 3.5.1

Error log
---------
/usr/src/packages/BUILD/cpuinfo-0.4/admin/missing: line 46: aclocal-1.6: command not found
WARNING: `aclocal-1.6' is missing on your system. You should only need it if
you modified `acinclude.m4' or `configure.in'. You might want
to install the `Automake' and `Perl' packages. Grab them from
any GNU archive site.
cd . && \
/bin/sh /usr/src/packages/BUILD/cpuinfo-0.4/admin/missing --run automake-1.6 --gnu Makefile
cd . && rm -f configure
/usr/src/packages/BUILD/cpuinfo-0.4/admin/missing: line 46: automake-1.6: command not found
WARNING: `automake-1.6' is missing on your system. You should only need it if
you modified `Makefile.am', `acinclude.m4' or `configure.in'.
You might want to install the `Automake' and `Perl' packages.
Grab them from any GNU archive site.
cd . && make -f admin/Makefile.common configure
make[1]: Entering directory `/usr/src/packages/BUILD/cpuinfo-0.4'
cd . && perl admin/am_edit Makefile.in
configure.in:39: error: possibly undefined macro: AM_INIT_AUTOMAKE
If this token and others are legitimate, please use m4_pattern_allow.
See the Autoconf documentation.
configure.in:44: error: possibly undefined macro: AM_CONFIG_HEADER
configure.in:47: error: possibly undefined macro: AC_CHECK_COMPILERS
configure.in:48: error: possibly undefined macro: AC_ENABLE_SHARED
configure.in:49: error: possibly undefined macro: AC_ENABLE_STATIC
configure.in:54: error: possibly undefined macro: AM_KDE_WITH_NLS
configure.in:57: error: possibly undefined macro: AC_PATH_KDE
configure.in:62: error: possibly undefined macro: AC_CHECK_KDEMAXPATHLEN
make[1]: make[1]: Leaving directory `/usr/src/packages/BUILD/cpuinfo-0.4'
*** [configure] Erreur 1
make: *** [configure] Erreur 2


RPM build errors:
error: Bad exit status from /var/tmp/rpm-tmp.14585 (%build)
Bad exit status from /var/tmp/rpm-tmp.14585 (%build)
- Mar 13 2006
k9copy

Utilities by jnmchlptt 244 comments

k9copy-1.0.4b1-S10K351.i586.rpm
at
http://home.tiscali.be/raoul.linux/downloadSuSE10.0.htm



ENJOY !!! - Mar 07 2006
k9copy

Utilities by jnmchlptt 244 comments

My Dear ,

It's not my job to apply a path to a package . It's the responsability of the project owner.

SORRY - Mar 06 2006
k9copy

Utilities by jnmchlptt 244 comments

On Suse 10.0 KDE 3.5.1
with K9copy-1.04 beta1

/bin/sh ../libtool --silent --mode=compile --tag=CXX g++ -DHAVE_CONFIG_H -I. -I. -I.. -I. -I/opt/kde3/include -I/usr/lib/qt3/include -I/usr/X11R6/include -DQT_THREAD_SUPPORT -D_REENTRANT -Wnon-virtual-dtor -Wno-long-long -Wundef -Wall -W -Wpointer-arith -Wwrite-strings -ansi -D_XOPEN_SOURCE=500 -D_BSD_SOURCE -Wcast-align -Wconversion -Wchar-subscripts -O2 -O2 -g -march=i586 -mtune=i686 -fmessage-length=0 -D_FORTIFY_SOURCE=2 -Wformat-security -Wmissing-format-attribute -fno-exceptions -fno-check-new -fno-common -c -o cpu_accel.lo `test -f 'cpu_accel.cpp' || echo './'`cpu_accel.cpp
cpu_accel.cpp:26:22: error: k9common.h: No such file or directory
mpeg2.h:49: error: 'uint32_t' does not name a type
mpeg2.h:56: error: 'uint8_t' does not name a type
mpeg2.h:57: error: 'uint8_t' does not name a type - Mar 06 2006
Firefox Quickstarter

Utilities by finrold 24 comments

firefoxqs-0.1-S10K351.i586.rpm
at
http://home.tiscali.be/raoul.linux/downloadSuSE10.0.htm


ENJOY !!! - Feb 28 2006
K3Guitune

Audio Apps by tuxrocker 21 comments

k3guitune-0.5.2-S10K351.i586.rpm
at
http://home.tiscali.be/raoul.linux/downloadSuSE10.0.htm


ENJOY !!! - Feb 11 2006
Keep

System Software by jrfaller 87 comments

keep-0.3.0-S10K351.i586.rpm
at
http://home.tiscali.be/raoul.linux/downloadSuSE10.0.htm


ENJOY !!!

note : compiled under KDE 3.5.1 - Feb 09 2006
KShutdown

Utilities by kdt 81 comments

kshutdown-0.8.2-S10K35.i586.rpm
at
http://home.tiscali.be/raoul.linux/downloadSuSE10.0.htm

ENJOY !!! - Feb 07 2006
kchmviewer

Utilities by gyunaev 103 comments

kchmviewer-2.0-S10K35.i586.rpm
at
http://home.tiscali.be/raoul.linux/downloadSuSE10.0.htm

ENJOY !!! - Feb 04 2006
Linux MultiMedia Studio

Audio Apps by tobydox 114 comments

ok
thanks - Feb 03 2006
KTranslator

Utilities by rgfernandes 124 comments

It seems when i create a rpm with your tarball ktranslator-0.4rc2 i have a version 3 when looking with About ktranslator option

STRANGE - Feb 03 2006
Linux MultiMedia Studio

Audio Apps by tobydox 114 comments

lmms-0.1.4-S10K35.i586.rpm
at
http://home.tiscali.be/raoul.linux/downloadSuSE10.0.ht



ENJOY !!! - Feb 03 2006
KTranslator

Utilities by rgfernandes 124 comments

If you have a bad configuration file , you cannot restart your Ktranslater having a crash . the only way is to destroy your configuration file.

I suggest to increase the control of the validity entries in your config file...

Example check if you have an entry for dictionary or checking if the the dictionary exist...

TO prevent a crash program - Feb 02 2006
KTranslator

Utilities by rgfernandes 124 comments

If you have a bad configuration file , you cannot restart your Ktranslater having a crash . the only way is to destroy your configuration file.

I suggest to increase the control of the validity entries in your config file...

Example check if you have an entry for dictionary entrie or cr checking if the the dictionary exist...

TO prevent a crash program - Feb 02 2006
KTranslator

Utilities by rgfernandes 124 comments

ktranslator-0.4_rc2-S10K35.i586.rpm
at
http://home.tiscali.be/raoul.linux/downloadSuSE10.0.htm



ENJOY !!!! - Feb 02 2006
k9copy

Utilities by jnmchlptt 244 comments

k9copy-1.0.3b-S10K35.i586.rpm
at
http://home.tiscali.be/raoul.linux/downloadSuSE10.0.htm


ENJOY !!! - Feb 02 2006
Keep

System Software by jrfaller 87 comments

keep-0.2.4-S10K35.i586.rpm
at
http://home.tiscali.be/raoul.linux/downloadSuSE10.0.htm


ENJOY !!! - Jan 31 2006
KDM Theme Manager

Various KDE 1.-4. Improvements by smileaf 237 comments

kdmtheme-1.0.1-S10K35.i586.rpm
at
http://home.tiscali.be/raoul.linux/downloadSuSE10.0.htm



ENJOY !!! - Jan 31 2006
k9copy

Utilities by jnmchlptt 244 comments

Is your correction 1.0.3b is included in your k9copy-1.0.3
Because I havethe same error ! !

In file included from k9common.h:28,
from k9dvd.h:22,
from k9dvd.cpp:30:
/usr/include/dvdread/ifo_types.h:32:2: error: #error "Must include or before any libdvdread header." - Jan 30 2006
k9copy

Utilities by jnmchlptt 244 comments

Thanks - Jan 29 2006
k9copy

Utilities by jnmchlptt 244 comments

Dear ,
I have compiled the version 1.02 in the same condition without problem.

Strange ! ! ! ! ! - Jan 29 2006
k9copy

Utilities by jnmchlptt 244 comments

Working on Suse 10.0
with GLIBC and GLIBc-devel v2.3.5
and
libdvdread and libdvdread-devel 0.9.5

Having during make phae the following error :

/bin/sh ../libtool --silent --mode=compile --tag=CXX g++ -DHAVE_CONFIG_H -I. -I. -I.. -I. -I/opt/kde3/include -I/usr/lib/qt3/include -I/usr/X11R6/include -DQT_THREAD_SUPPORT -D_REENTRANT -Wnon-virtual-dtor -Wno-long-long -Wundef -Wall -W -Wpointer-arith -Wwrite-strings -ansi -D_XOPEN_SOURCE=500 -D_BSD_SOURCE -Wcast-align -Wconversion -Wchar-subscripts -O2 -O2 -g -march=i586 -mtune=i686 -fmessage-length=0 -D_FORTIFY_SOURCE=2 -Wformat-security -Wmissing-format-attribute -fno-exceptions -fno-check-new -fno-common -c -o k9dvd.lo `test -f 'k9dvd.cpp' || echo './'`k9dvd.cpp
In file included from k9common.h:22,
from k9dvdauthor.h:23,
from k9dvdauthor.cpp:22:
/usr/include/dvdread/ifo_types.h:32:2: error: #error "Must include or before any libdvdread header."
In file included from k9common.h:22,
from k9dvd.h:22,
from k9dvd.cpp:30:
/usr/include/dvdread/ifo_types.h:32:2: error: #error "Must include or before any libdvdread header."
/usr/include/dvdread/ifo_types.h:68: error: 'uint8_t' does not name a type
/usr/include/dvdread/ifo_types.h:69: error: 'uint8_t' does not name a type
/usr/include/dvdread/ifo_types.h:70: error: 'uint8_t' does not name a type
/usr/include/dvdread/ifo_types.h:71: error: 'uint8_t' does not name a type
/usr/include/dvdread/ifo_types.h:78: error: 'uint8_t' does not name a type
/usr/include/dvdread/ifo_types.h:143: error: 'uint16_t' does not name a type
/usr/include/dvdread/ifo_types.h:144: error: 'uint8_t' does not name a type
/usr/include/dvdread/ifo_types.h:145: error: 'uint8_t' does not name a type
/usr/include/dvdread/ifo_types.h:146: error: 'uint8_t' does not name a type
/usr/include/dvdread/ifo_types.h:231: error: 'uint8_t' does not name a type
/usr/include/dvdread/ifo_types.h:258: error: 'uint8_t' does not name a type
/usr/include/dvdread/ifo_types.h:259: error: 'uint16_t' does not name a type
/usr/include/dvdread/ifo_types.h:260: error: 'uint8_t' does not name a type
/usr/include/dvdread/ifo_types.h:261: error: 'uint8_t' does not name a type
/usr/include/dvdread/ifo_types.h:270: error: 'uint16_t' does not name a type
/usr/include/dvdread/ifo_types.h:271: error: 'uint16_t' does not name a type
/usr/include/dvdread/ifo_types.h:272: error: 'uint16_t' does not name a type
/usr/include/dvdread/ifo_types.h:273: error: 'uint16_t' does not name a type
/usr/include/dvdread/ifo_types.h:283: error: 'uint8_t' does not name a type
/usr/include/dvdread/ifo_types.h:312: error: 'uint8_t' does not name a type
/usr/include/dvdread/ifo_types.h:313: error: 'uint8_t' does not name a type
/usr/include/dvdread/ifo_types.h:315: error: 'uint32_t' does not name a type
/usr/include/dvdread/ifo_types.h:316: error: 'uint32_t' does not name a type
/usr/include/dvdread/ifo_types.h:317: error: 'uint32_t' does not name a type
/usr/include/dvdread/ifo_types.h:318: error: 'uint32_t' does not name a type
/usr/include/dvdread/ifo_types.h:333: error: 'uint16_t' does not name a type
/usr/include/dvdread/ifo_types.h:334: error: 'uint8_t' does not name a type
/usr/include/dvdread/ifo_types.h:335: error: 'uint8_t' does not name a type
/usr/include/dvdread/ifo_types.h:409: error: 'uint16_t' does not name a type
/usr/include/dvdread/ifo_types.h:410: error: 'uint8_t' does not name a type
/usr/include/dvdread/ifo_types.h:411: error: 'uint8_t' does not name a type
/usr/include/dvdread/ifo_types.h:414: error: 'uint16_t' does not name a type
/usr/include/dvdread/ifo_types.h:415: error: 'uint32_t' does not name a type
/usr/include/dvdread/ifo_types.h:416: error: 'uint16_t' does not name a type
/usr/include/dvdread/ifo_types.h:417: error: 'uint16_t' does not name a type
/usr/include/dvdread/ifo_types.h:418: error: 'uint16_t' does not name a type
/usr/include/dvdread/ifo_types.h:419: error: 'uint8_t' does not name a type
/usr/include/dvdread/ifo_types.h:420: error: 'uint8_t' does not name a type
/usr/include/dvdread/ifo_types.h:421: error: 'uint32_t' does not name a type
/usr/include/dvdread/ifo_types.h:422: error: 'uint16_t' does not name a type
/usr/include/dvdread/ifo_types.h:423: error: 'uint16_t' does not name a type
/usr/include/dvdread/ifo_types.h:424: error: 'uint16_t' does not name a type
/usr/include/dvdread/ifo_types.h:425: error: 'uint16_t' does not name a type
/usr/include/dvdread/ifo_types.h:427: error: expected ';' before '*' token
/usr/include/dvdread/ifo_types.h:437: error: 'uint8_t' does not name a type
/usr/include/dvdread/ifo_types.h:447: error: 'uint16_t' does not name a type
/usr/include/dvdread/ifo_types.h:448: error: 'uint32_t' does not name a type
/usr/include/dvdread/ifo_types.h:457: error: 'uint16_t' does not name a type
/usr/include/dvdread/ifo_types.h:458: error: 'uint16_t' does not name a type
/usr/include/dvdread/ifo_types.h:459: error: 'uint32_t' does not name a type
/usr/include/dvdread/ifo_types.h:468: error: 'uint16_t' does not name a type
/usr/include/dvdread/ifo_types.h:469: error: 'uint8_t' does not name a type
/usr/include/dvdread/ifo_types.h:470: error: 'uint8_t' does not name a type
/usr/include/dvdread/ifo_types.h:471: error: 'uint32_t' does not name a type
/usr/include/dvdread/ifo_types.h:480: error: 'uint16_t' does not name a type
/usr/include/dvdread/ifo_types.h:481: error: 'uint16_t' does not name a type
/usr/include/dvdread/ifo_types.h:482: error: 'uint32_t' does not name a type
/usr/include/dvdread/ifo_types.h:491: error: 'uint16_t' does not name a type
/usr/include/dvdread/ifo_types.h:492: error: 'uint8_t' does not name a type
/usr/include/dvdread/ifo_types.h:493: error: 'uint8_t' does not name a type
/usr/include/dvdread/ifo_types.h:494: error: 'uint32_t' does not name a type
/usr/include/dvdread/ifo_types.h:495: error: 'uint32_t' does not name a type
/usr/include/dvdread/ifo_types.h:502: error: 'uint16_t' does not name a type
/usr/include/dvdread/ifo_types.h:503: error: 'uint16_t' does not name a type
/usr/include/dvdread/ifo_types.h:504: error: 'uint32_t' does not name a type
/usr/include/dvdread/ifo_types.h:513: error: 'uint32_t' does not name a type
/usr/include/dvdread/ifo_types.h:514: error: expected ';' before '*' token
/usr/include/dvdread/ifo_types.h:532: error: 'uint32_t' does not name a type
/usr/include/dvdread/ifo_types.h:533: error: 'uint8_t' does not name a type
/usr/include/dvdread/ifo_types.h:534: error: 'uint32_t' does not name a type
/usr/include/dvdread/ifo_types.h:535: error: 'uint8_t' does not name a type
/usr/include/dvdread/ifo_types.h:536: error: 'uint8_t' does not name a type
/usr/include/dvdread/ifo_types.h:537: error: 'uint32_t' does not name a type
/usr/include/dvdread/ifo_types.h:538: error: 'uint16_t' does not name a type
/usr/include/dvdread/ifo_types.h:539: error: 'uint16_t' does not name a type
/usr/include/dvdread/ifo_types.h:540: error: 'uint8_t' does not name a type
/usr/include/dvdread/ifo_types.h:541: error: 'uint8_t' does not name a type
/usr/include/dvdread/ifo_types.h:542: error: 'uint16_t' does not name a type
/usr/include/dvdread/ifo_types.h:544: error: 'uint64_t' does not name a type
/usr/include/dvdread/ifo_types.h:545: error: 'uint8_t' does not name a type
/usr/include/dvdread/ifo_types.h:546: error: 'uint32_t' does not name a type
/usr/include/dvdread/ifo_types.h:547: error: 'uint32_t' does not name a type
/usr/include/dvdread/ifo_types.h:548: error: 'uint8_t' does not name a type
/usr/include/dvdread/ifo_types.h:549: error: 'uint32_t' does not name a type
/usr/include/dvdread/ifo_types.h:550: error: 'uint32_t' does not name a type
/usr/include/dvdread/ifo_types.h:551: error: 'uint32_t' does not name a type
/usr/include/dvdread/ifo_types.h:552: error: 'uint32_t' does not name a type
/usr/include/dvdread/ifo_types.h:553: error: 'uint32_t' does not name a type
/usr/include/dvdread/ifo_types.h:554: error: 'uint32_t' does not name a type
/usr/include/dvdread/ifo_types.h:555: error: 'uint32_t' does not name a type
/usr/include/dvdread/ifo_types.h:556: error: 'uint32_t' does not name a type
/usr/include/dvdread/ifo_types.h:557: error: 'uint8_t' does not name a type
/usr/include/dvdread/ifo_types.h:560: error: 'uint8_t' does not name a type
/usr/include/dvdread/ifo_types.h:561: error: 'uint8_t' does not name a type
/usr/include/dvdread/ifo_types.h:564: error: 'uint8_t' does not name a type
/usr/include/dvdread/ifo_types.h:565: error: 'uint8_t' does not name a type
/usr/include/dvdread/ifo_types.h:597: error: 'uint8_t' does not name a type
/usr/include/dvdread/ifo_types.h:598: error: 'uint16_t' does not name a type
/usr/include/dvdread/ifo_types.h:599: error: 'uint16_t' does not name a type
/usr/include/dvdread/ifo_types.h:600: error: 'uint8_t' does not name a type
/usr/include/dvdread/ifo_types.h:601: error: 'uint8_t' does not name a type
/usr/include/dvdread/ifo_types.h:602: error: 'uint32_t' does not name a type
/usr/include/dvdread/ifo_types.h:609: error: 'uint16_t' does not name a type
/usr/include/dvdread/ifo_types.h:610: error: 'uint16_t' does not name a type
/usr/include/dvdread/ifo_types.h:611: error: 'uint32_t' does not name a type
/usr/include/dvdread/ifo_types.h:621: error: 'uint16_t' does not name a type
/usr/include/dvdread/ifo_types.h:627: error: 'uint16_t' does not name a type
/usr/include/dvdread/ifo_types.h:628: error: 'uint16_t' does not name a type
/usr/include/dvdread/ifo_types.h:629: error: 'uint16_t' does not name a type
/usr/include/dvdread/ifo_types.h:630: error: 'uint16_t' does not name a type
/usr/include/dvdread/ifo_types.h:631: error: expected ';' before '*' token
/usr/include/dvdread/ifo_types.h:639: error: 'uint16_t' does not name a type
/usr/include/dvdread/ifo_types.h:640: error: 'uint16_t' does not name a type
/usr/include/dvdread/ifo_types.h:641: error: 'uint32_t' does not name a type
/usr/include/dvdread/ifo_types.h:650: error: 'uint32_t' does not name a type
/usr/include/dvdread/ifo_types.h:651: error: 'uint32_t' does not name a type
/usr/include/dvdread/ifo_types.h:654: error: 'uint8_t' does not name a type
/usr/include/dvdread/ifo_types.h:655: error: 'uint8_t' does not name a type
/usr/include/dvdread/ifo_types.h:658: error: 'uint8_t' does not name a type
/usr/include/dvdread/ifo_types.h:659: error: 'uint8_t' does not name a type
/usr/include/dvdread/ifo_types.h:660: error: 'uint8_t' does not name a type
/usr/include/dvdread/ifo_types.h:664: error: 'uint8_t' does not name a type
/usr/include/dvdread/ifo_types.h:667: error: 'uint8_t' does not name a type
/usr/include/dvdread/ifo_types.h:668: error: 'uint8_t' does not name a type
/usr/include/dvdread/ifo_types.h:670: error: 'uint8_t' does not name a type
/usr/include/dvdread/ifo_types.h:671: error: 'uint8_t' does not name a type
/usr/include/dvdread/ifo_types.h:672: error: 'uint8_t' does not name a type
/usr/include/dvdread/ifo_types.h:682: error: 'uint16_t' does not name a type
/usr/include/dvdread/ifo_types.h:683: error: 'uint16_t' does not name a type
/usr/include/dvdread/ifo_types.h:684: error: 'uint32_t' does not name a type
/usr/include/dvdread/ifo_types.h:686: error: expected ';' before '*' token
/usr/include/dvdread/ifo_types.h:694: error: 'uint32_t' does not name a type
/usr/include/dvdread/ifo_types.h:695: error: 'uint16_t' does not name a type
/usr/include/dvdread/ifo_types.h:716: error: 'uint16_t' does not name a type
/usr/include/dvdread/ifo_types.h:717: error: 'uint16_t' does not name a type
/usr/include/dvdread/ifo_types.h:718: error: 'uint32_t' does not name a type
/usr/include/dvdread/ifo_types.h:728: error: 'uint16_t' does not name a type
/usr/include/dvdread/ifo_types.h:729: error: 'uint32_t' does not name a type
/usr/include/dvdread/ifo_types.h:746: error: 'uint32_t' does not name a type
/usr/include/dvdread/ifo_types.h:747: error: 'uint8_t' does not name a type
/usr/include/dvdread/ifo_types.h:748: error: 'uint32_t' does not name a type
/usr/include/dvdread/ifo_types.h:749: error: 'uint8_t' does not name a type
/usr/include/dvdread/ifo_types.h:750: error: 'uint8_t' does not name a type
/usr/include/dvdread/ifo_types.h:751: error: 'uint32_t' does not name a type
/usr/include/dvdread/ifo_types.h:752: error: 'uint16_t' does not name a type
/usr/include/dvdread/ifo_types.h:753: error: 'uint16_t' does not name a type
/usr/include/dvdread/ifo_types.h:754: error: 'uint8_t' does not name a type
/usr/include/dvdread/ifo_types.h:755: error: 'uint8_t' does not name a type
/usr/include/dvdread/ifo_types.h:756: error: 'uint16_t' does not name a type
/usr/include/dvdread/ifo_types.h:757: error: 'uint8_t' does not name a type
/usr/include/dvdread/ifo_types.h:758: error: 'uint64_t' does not name a type
/usr/include/dvdread/ifo_types.h:759: error: 'uint8_t' does not name a type
/usr/include/dvdread/ifo_types.h:760: error: 'uint32_t' does not name a type
/usr/include/dvdread/ifo_types.h:761: error: 'uint32_t' does not name a type
/usr/include/dvdread/ifo_types.h:762: error: 'uint8_t' does not name a type
/usr/include/dvdread/ifo_types.h:763: error: 'uint32_t' does not name a type
/usr/include/dvdread/ifo_types.h:764: error: 'uint32_t' does not name a type
/usr/include/dvdread/ifo_types.h:765: error: 'uint32_t' does not name a type
/usr/include/dvdread/ifo_types.h:766: error: 'uint32_t' does not name a type
/usr/include/dvdread/ifo_types.h:767: error: 'uint32_t' does not name a type
/usr/include/dvdread/ifo_types.h:768: error: 'uint32_t' does not name a type
/usr/include/dvdread/ifo_types.h:769: error: 'uint32_t' does not name a type
/usr/include/dvdread/ifo_types.h:770: error: 'uint32_t' does not name a type
/usr/include/dvdread/ifo_types.h:771: error: 'uint32_t' does not name a type
/usr/include/dvdread/ifo_types.h:772: error: 'uint32_t' does not name a type
/usr/include/dvdread/ifo_types.h:773: error: 'uint8_t' does not name a type
/usr/include/dvdread/ifo_types.h:776: error: 'uint8_t' does not name a type
/usr/include/dvdread/ifo_types.h:777: error: 'uint8_t' does not name a type
/usr/include/dvdread/ifo_types.h:780: error: 'uint8_t' does not name a type
/usr/include/dvdread/ifo_types.h:781: error: 'uint8_t' does not name a type
/usr/include/dvdread/ifo_types.h:784: error: 'uint8_t' does not name a type
/usr/include/dvdread/ifo_types.h:787: error: 'uint8_t' does not name a type
/usr/include/dvdread/ifo_types.h:788: error: 'uint8_t' does not name a type
/usr/include/dvdread/ifo_types.h:790: error: 'uint8_t' does not name a type
/usr/include/dvdread/ifo_types.h:791: error: 'uint8_t' does not name a type
/usr/include/dvdread/ifo_types.h:793: error: 'uint16_t' does not name a type
/usr/include/dvdread/ifo_types.h:802: error: 'uint16_t' does not name a type
/usr/include/dvdread/ifo_types.h:803: error: 'uint16_t' does not name a type
/usr/include/dvdread/ifo_types.h:810: error: 'uint16_t' does not name a type
/usr/include/dvdread/ifo_types.h:818: error: 'uint16_t' does not name a type
/usr/include/dvdread/ifo_types.h:819: error: 'uint16_t' does not name a type
/usr/include/dvdread/ifo_types.h:820: error: 'uint32_t' does not name a type
/usr/include/dvdread/ifo_types.h:822: error: expected ';' before '*' token
/usr/include/dvdread/ifo_types.h:831: error: 'uint32_t' does not name a type
/usr/include/dvdread/ifo_types.h:837: error: 'uint8_t' does not name a type
/usr/include/dvdread/ifo_types.h:838: error: 'uint8_t' does not name a type
/usr/include/dvdread/ifo_types.h:839: error: 'uint16_t' does not name a type
/usr/include/dvdread/ifo_types.h:840: error: expected ';' before '*' token
/usr/include/dvdread/ifo_types.h:848: error: 'uint16_t' does not name a type
/usr/include/dvdread/ifo_types.h:849: error: 'uint16_t' does not name a type
/usr/include/dvdread/ifo_types.h:850: error: 'uint32_t' does not name a type
/usr/include/dvdread/ifo_types.h:852: error: expected ';' before '*' token
/usr/include/dvdread/nav_types.h:73: error: 'uint32_t' does not name a type
/usr/include/dvdread/nav_types.h:74: error: 'uint16_t' does not name a type
/usr/include/dvdread/nav_types.h:75: error: 'uint16_t' does not name a type
/usr/include/dvdread/nav_types.h:77: error: 'uint32_t' does not name a type
/usr/include/dvdread/nav_types.h:78: error: 'uint32_t' does not name a type
/usr/include/dvdread/nav_types.h:79: error: 'uint32_t' does not name a type
/usr/include/dvdread/nav_types.h:88: error: 'uint32_t' does not name a type
/usr/include/dvdread/nav_types.h:101: error: 'uint16_t' does not name a type
/usr/include/dvdread/nav_types.h:102: error: 'uint32_t' does not name a type
/usr/include/dvdread/nav_types.h:103: error: 'uint32_t' does not name a type
/usr/include/dvdread/nav_types.h:104: error: 'uint32_t' does not name a type
/usr/include/dvdread/nav_types.h:124: error: 'uint8_t' does not name a type
/usr/include/dvdread/nav_types.h:125: error: 'uint8_t' does not name a type
/usr/include/dvdread/nav_types.h:126: error: 'uint8_t' does not name a type
/usr/include/dvdread/nav_types.h:127: error: 'uint8_t' does not name a type
/usr/include/dvdread/nav_types.h:128: error: 'uint8_t' does not name a type
/usr/include/dvdread/nav_types.h:129: error: 'uint8_t' does not name a type
/usr/include/dvdread/nav_types.h:142: error: 'uint32_t' does not name a type
/usr/include/dvdread/nav_types.h:213: error: 'uint8_t' does not name a type
/usr/include/dvdread/nav_types.h:223: error: 'uint32_t' does not name a type
/usr/include/dvdread/nav_types.h:224: error: 'uint32_t' does not name a type
/usr/include/dvdread/nav_types.h:225: error: 'uint32_t' does not name a type
/usr/include/dvdread/nav_types.h:226: error: 'uint32_t' does not name a type
/usr/include/dvdread/nav_types.h:227: error: 'uint32_t' does not name a type
/usr/include/dvdread/nav_types.h:228: error: 'uint32_t' does not name a type
/usr/include/dvdread/nav_types.h:229: error: 'uint16_t' does not name a type
/usr/include/dvdread/nav_types.h:230: error: 'uint8_t' does not name a type
/usr/include/dvdread/nav_types.h:231: error: 'uint8_t' does not name a type
/usr/include/dvdread/nav_types.h:239: error: 'uint16_t' does not name a type
/usr/include/dvdread/nav_types.h:240: error: 'uint32_t' does not name a type
/usr/include/dvdread/nav_types.h:241: error: 'uint32_t' does not name a type
/usr/include/dvdread/nav_types.h:242: error: 'uint16_t' does not name a type
/usr/include/dvdread/nav_types.h:243: error: 'uint32_t' does not name a type
/usr/include/dvdread/nav_types.h:244: error: 'uint32_t' does not name a type
/usr/include/dvdread/nav_types.h:246: error: 'uint32_t' does not name a type
/usr/include/dvdread/nav_types.h:247: error: 'uint32_t' does not name a type
/usr/include/dvdread/nav_types.h:248: error: 'uint32_t' does not name a type
/usr/include/dvdread/nav_types.h:249: error: 'uint32_t' does not name a type
/usr/include/dvdread/nav_types.h:257: error: 'uint32_t' does not name a type
/usr/include/dvdread/nav_types.h:258: error: 'uint16_t' does not name a type
/usr/include/dvdread/nav_types.h:272: error: 'uint32_t' does not name a type
/usr/include/dvdread/nav_types.h:273: error: 'uint32_t' does not name a type
/usr/include/dvdread/nav_types.h:274: error: 'uint32_t' does not name a type
/usr/include/dvdread/nav_types.h:275: error: 'uint32_t' does not name a type
/usr/include/dvdread/nav_types.h:276: error: 'uint32_t' does not name a type
/usr/include/dvdread/nav_types.h:277: error: 'uint32_t' does not name a type
/usr/include/dvdread/nav_types.h:286: error: 'uint16_t' does not name a type
/usr/include/dvdread/nav_types.h:287: error: 'uint32_t' does not name a type
/usr/include/dvdread/nav_types.h:299: error: 'uint8_t' does not name a type
k9dvdtitle.h: In member function 'virtual uchar k9ChapterCell::setangleBlock(uchar)':
k9dvdtitle.h:39: warning: no return statement in function returning non-void
k9dvd.cpp: In member function 'virtual k9DVDTitle* k9DVD::gettitleByNum(int)':
k9dvd.cpp:42: warning: comparison between signed and unsigned integer expressions
k9dvdtitle.h: In member function 'virtual uchar k9ChapterCell::setangleBlock(uchar)':
k9dvdtitle.h:39: warning: no return statement in function returning non-void
k9dvd.cpp: At global scope:
k9dvd.cpp:86: warning: unused parameter 'parent'
k9dvd.cpp:86: warning: unused parameter 'name'
k9dvd.cpp:86: warning: unused parameter 'args'
k9dvd.cpp:86: warning: unused parameter 'parent'
k9dvd.cpp:86: warning: unused parameter 'name'
k9dvd.cpp:86: warning: unused parameter 'args'
k9dvd.cpp: In member function 'int k9DVD::dvdtime2msec(dvd_time_t*)':
k9dvd.cpp:182: warning: converting to 'long int' from 'double'
k9dvd.cpp: In member function 'virtual int k9DVD::scandvd(const QString&)':
k9dvd.cpp:510: warning: comparison between signed and unsigned integer expressions
k9dvd.cpp:527: warning: comparison between signed and unsigned integer expressions
k9dvd.cpp:527: warning: comparison between signed and unsigned integer expressions
k9dvdauthor.cpp: At global scope:
k9dvdauthor.cpp:41: warning: unused parameter 'name'
k9dvdauthor.cpp:41: warning: unused parameter 'args'
k9dvdauthor.cpp:41: warning: unused parameter 'name'
k9dvdauthor.cpp:41: warning: unused parameter 'args'
k9dvd.cpp: In member function 'k9DVDTitle* k9DVD::addTitle(k9DVDTitleset*, int, int, int, int, int, bool)':
k9dvd.cpp:633: warning: comparison between signed and unsigned integer expressions
k9dvd.cpp:637: warning: comparison between signed and unsigned integer expressions
k9dvd.cpp:639: warning: comparison between signed and unsigned integer expressions
k9dvd.cpp:639: warning: comparison between signed and unsigned integer expressions
make[2]: *** [k9dvdauthor.lo] Erreur 1
make[2]: *** Attente des tâches non terminées....
k9dvd.cpp: In member function 'int k9DVD::getVampsID(int)':
k9dvd.cpp:996: warning: 'abase' may be used uninitialized in this function
make[2]: make[2]: Leaving directory `/usr/src/packages/BUILD/k9copy-1.0.3/libk9copy'
*** [k9dvd.lo] Erreur 1
make[1]: Leaving directory `/usr/src/packages/BUILD/k9copy-1.0.3'
make[1]: *** [all-recursive] Erreur 1
make: *** [all] Erreur 2
error: Bad exit status from /var/tmp/rpm-tmp.50396 (%build)
Bad exit status from /var/tmp/rpm-tmp.50396 (%build)


RPM build errors: - Jan 29 2006
Keep

System Software by jrfaller 87 comments

keep-0.2.3-S10K35.i586.rpm
at
http://home.tiscali.be/raoul.linux/downloadSuSE10.0.htm


ENJOY !!! - Jan 26 2006
Klear

Video Apps by kraus 44 comments

it's possible to have tarball with configure and make file to create a RPM.

I cannot create a RPM with scons ????? - Jan 25 2006
KMediaFactory

Video Apps by pdamsten 52 comments

kmediafactory-0.5.0-S10K35.i586.rpm
at
http://home.tiscali.be/raoul.linux/downloadSuSE10.0.htm


ENJOY !!! - Jan 24 2006
Scribus

Office Apps by scribusdocs 61 comments

scribus-1.3.2-S10K35.i586.rpm
at
http://home.tiscali.be/raoul.linux/downloadSuSE10.0.htm


ENJOY !!! - Jan 23 2006
Scribus

Office Apps by scribusdocs 61 comments

scribus-1.3.2-S10K35.i586.rpm
at
http://home.tiscali.be/raoul.linux/downloadSuSE10.0.htm


ENJOY !!! - Jan 23 2006
ShowImg

Graphic Apps by rgroult 69 comments

showimg-0.9.5-S10K35.i586.rpm
at
http://home.tiscali.be/raoul.linux/downloadSuSE10.0.htm


ENJOY !!! - Jan 15 2006
ipodslave

Utilities by Fry26 74 comments

ipodslave-0.7.2-S10K35.i386.rpm
at
http://home.tiscali.be/raoul.linux/downloadSuSE10.0.htm


ENJOY !!! - Jan 14 2006
Kima - kicker monitoring applet

Various KDE 1.-4. Improvements by kenws 360 comments

cpuinfo-0.2.S10K35.i586.rpm
at
http://home.tiscali.be/raoul.linux/downloadSuSE10.0.htm


ENJOY !!! - Jan 11 2006
Kima - kicker monitoring applet

Various KDE 1.-4. Improvements by kenws 360 comments

cpuinfo-0.1-S10K35.i586.rpm
at
http://home.tiscali.be/raoul.linux/downloadSuSE10.0.htm


ENJOY !!! - Jan 05 2006
KCheckers

Board by kcheckers 21 comments

kcheckers-0.8.1-1.i586.rpm
at
http://home.tiscali.be/raoul.linux/downloadSuSE10.0.htm

and

kcheckers-0.8.1-1.x86_64.rpm
at
http://home.tiscali.be/raoul.linux/downloadS10X64.htm


ENJOY !!! - Dec 30 2005
KIso

Utilities by Mephistoki 81 comments

kiso-0.8.3-S10K35.i586.rpm
at
http://home.tiscali.be/raoul.linux/downloadSuSE10.0.htm


ENJOY !!! - Dec 30 2005
KDM Theme Manager

Various KDE 1.-4. Improvements by smileaf 237 comments

kdmtheme-0.9.2-S10K35.i586.rpm
at
http://home.tiscali.be/raoul.linux/downloadSuSE10.0.htm


ENKOY !!! - Dec 30 2005
Scribus

Office Apps by scribusdocs 61 comments

After the collaboration of Gille for correction the tarball , we have a RPM for Suse
Thanks at Gilles

scribus-1.3.1-1.S10K35.i586.rpm
at
http://home.tiscali.be/raoul.linux/downloadSuSE10.0.htm


ENJOY !!! - Dec 24 2005
Linux MultiMedia Studio

Audio Apps by tobydox 114 comments

lmms-0.1.2-S10K35.i586.rpm
at
http://home.tiscali.be/raoul.linux/downloadSuSE10.0.htm


ENJOY !!! - Dec 23 2005
Kompile

System Software by invernomuto 100 comments

kompile-0.2-S10K35.i586.rpm
at
http://home.tiscali.be/raoul.linux/downloadSuSE10.0.htm


ENJOY !!! - Dec 23 2005
Konjue

Education Apps by ppareit 26 comments

konjue-0.4.0-S10K35.i586.rpm
and
verbiste-0.1.14-SuSE9.3K343.i586.rpm

at
http://home.tiscali.be/raoul.linux/downloadSuSE10.0.htm


ENJOY !!! - Dec 22 2005
kmhtConvert

Utilities by spiros2907 32 comments

kmhtconvert-0.7.3-S10K35.i586.rpm
at
http://home.tiscali.be/raoul.linux/downloadSuSE10.0.htm


ENJOY !!! - Dec 21 2005
k9copy

Utilities by jnmchlptt 244 comments

k9copy-1.0.2-S10K35.i586.rpm
at
http://home.tiscali.be/raoul.linux/downloadSuSE10.0.htm


ENJOY !!! - Dec 21 2005
KBFX Silk (KBFX 0.4.9.3.1)

Various KDE 1.-4. Improvements by sirajr 613 comments

kbfx-0.4.8rc1-S10K35.i586.rpm
at
http://home.tiscali.be/raoul.linux/downloadSuSE10.0.htm


ENJOY !!!! - Dec 18 2005