Image 01
profile-image

mathieu

Mathieu Roussel
KDM Theme Manager

Various KDE 1.-4. Improvements by smileaf 237 comments

still get the same error :( - Mar 24 2005
KDM Theme Manager

Various KDE 1.-4. Improvements by smileaf 237 comments

mathieu@163-154:~/kdmtheme> make -f Makefile.cvs
This Makefile is only for the CVS repository
This will be deleted before making the distribution

*** Creating acinclude.m4
*** Creating list of subdirectories
*** Creating configure.in
*** Creating aclocal.m4
/usr/share/aclocal/avifile.m4:21: warning: underquoted definition of AM_PATH_AVI
FILE
run info '(automake)Extending aclocal'
or see http://sources.redhat.com/automake/automake.html#Extending-aclocal
/opt/gnome/share/aclocal/gst-element-check-0.6.m4:7: warning: underquoted defini
tion of AM_GST_ELEMENT_CHECK
/usr/local/share/aclocal/pkg.m4:5: warning: underquoted definition of PKG_CHECK_
MODULES
NONE:0: /usr/bin/m4: `m4_symbols' from frozen file not found in builtin table!
autom4te: /usr/bin/m4 failed with exit status: 1
aclocal: autom4te failed with exit status: 1
make[1]: *** [cvs] Error 1
make: *** [all] Error 2


ideas? - Mar 24 2005
KDM Theme Manager

Various KDE 1.-4. Improvements by smileaf 237 comments

mathieu@163-154:~/kdmtheme> make -f Makefile.cvs
This Makefile is only for the CVS repository
This will be deleted before making the distribution

*** Creating acinclude.m4
*** Creating list of subdirectories
*** Creating configure.in
*** Creating aclocal.m4
/usr/share/aclocal/avifile.m4:21: warning: underquoted definition of AM_PATH_AVIFILE
run info '(automake)Extending aclocal'
or see http://sources.redhat.com/automake/automake.html#Extending-aclocal
/opt/gnome/share/aclocal/gst-element-check-0.6.m4:7: warning: underquoted definition of AM_GST_ELEMENT_CHECK
/usr/local/share/aclocal/pkg.m4:5: warning: underquoted definition of PKG_CHECK_MODULES
NONE:0: /usr/bin/m4: `m4_symbols' from frozen file not found in builtin table!
autom4te: /usr/bin/m4 failed with exit status: 1
aclocal: autom4te failed with exit status: 1
make[1]: *** [cvs] Error 1
make: *** [all] Error 2


that's what i get when i do make -f Makefile.cvs - Mar 24 2005
KDM Theme Manager

Various KDE 1.-4. Improvements by smileaf 237 comments

mathieu@163-154:~/kdmtheme> ./configure
configure: error: cannot find sources (acinclude.m4) in . or ..


anyone know how to fix it? - Mar 24 2005