Image 01
profile-image

RalIlAn

Konstantin Pugin Omsk, Russian Federation
Will it be with changed Gtk3 themes API? - May 03 2011
Daisy

Plasma 4 Extensions by Lechio 574 comments

Possible to handle grouping with taskmanager plasmoid? - Nov 21 2010
Can it be possible (for light *box and Compiz stalone environments?) - Sep 14 2010
Some testing:
1. Bug on PyGTK apps who modifies the window itself(examples: Sonata, Totem)
2. Bug is crash on startup, no excluding lists help
3. If no opacity used, no bug. - Aug 30 2010
sonata counts its window as dialog, I think. It crashes if includes in no menu opacity and no background opacity lists. - Aug 29 2010
Sonata and Totem segfaults with transparency (maybe other pygtk apps). QtCurve 1.5.2 ArchLinux x86_64. KDE 4.5. If set opacity on 100%, sonata and totem runs normally. - Aug 28 2010
Bespin

Be-Shell/Bespin by thomas12777 1663 comments

Thanks, Aristarh,but I solve this problem already:) From AUR - no, because I also have OpenSUSE - Jun 05 2009
Bespin

Be-Shell/Bespin by thomas12777 1663 comments

Above logs in English - May 31 2009
Bespin

Be-Shell/Bespin by thomas12777 1663 comments

But all KDE base packages installed... - May 31 2009
Bespin

Be-Shell/Bespin by thomas12777 1663 comments

[ 81%] Building CXX object kwin/CMakeFiles/kwin3_bespin.dir/kwin3_bespin_automoc.o
In file included from /home/user/cloudcity/build/kwin/moc_client.cpp:10,
from /home/user/cloudcity/build/kwin/kwin3_bespin_automoc.cpp:5:
/home/user/cloudcity/build/kwin/../../kwin/client.h:31:25: error: kdecoration.h: No such file or directory
In file included from /home/user/cloudcity/build/kwin/../../kwin/client.h:32,
from /home/user/cloudcity/build/kwin/moc_client.cpp:10,
from /home/user/cloudcity/build/kwin/kwin3_bespin_automoc.cpp:5:
/home/user/cloudcity/build/kwin/../../kwin/factory.h:32:32: error: kdecorationfactory.h: No such file or directory
In file included from /home/user/cloudcity/build/kwin/../../kwin/factory.h:33,
from /home/user/cloudcity/build/kwin/../../kwin/client.h:32,
from /home/user/cloudcity/build/kwin/moc_client.cpp:10,
from /home/user/cloudcity/build/kwin/kwin3_bespin_automoc.cpp:5:
/home/user/cloudcity/build/kwin/../../kwin/../gradients.h:69: warning: type qualifiers ignored on function return type
/home/user/cloudcity/build/kwin/../../kwin/../gradients.h:73: warning: type qualifiers ignored on function return type
In file included from /home/user/cloudcity/build/kwin/../../kwin/client.h:32,
from /home/user/cloudcity/build/kwin/moc_client.cpp:10,
from /home/user/cloudcity/build/kwin/kwin3_bespin_automoc.cpp:5:
/home/user/cloudcity/build/kwin/../../kwin/factory.h:53: error: expected class-name before '{' token
/home/user/cloudcity/build/kwin/../../kwin/factory.h:57: error: ISO C++ forbids declaration of 'KDecoration' with no type
/home/user/cloudcity/build/kwin/../../kwin/factory.h:57: error: expected ';' before '*' token
/home/user/cloudcity/build/kwin/../../kwin/factory.h:59: error: 'Ability' has not been declared
/home/user/cloudcity/build/kwin/../../kwin/factory.h:63: error: 'BorderSize' was not declared in this scope
/home/user/cloudcity/build/kwin/../../kwin/factory.h:63: error: template argument 1 is invalid
/home/user/cloudcity/build/kwin/../../kwin/factory.h: In member function 'int Bespin::Factory::borderSizes() const':
/home/user/cloudcity/build/kwin/../../kwin/factory.h:65: error: 'BorderSize' was not declared in this scope
/home/user/cloudcity/build/kwin/../../kwin/factory.h:65: error: template argument 1 is invalid
/home/user/cloudcity/build/kwin/../../kwin/factory.h:65: error: 'BorderTiny' was not declared in this scope
/home/user/cloudcity/build/kwin/../../kwin/factory.h:65: error: 'BorderNormal' was not declared in this scope
/home/user/cloudcity/build/kwin/../../kwin/factory.h:66: error: 'BorderLarge' was not declared in this scope
/home/user/cloudcity/build/kwin/../../kwin/factory.h:66: error: 'BorderVeryLarge' was not declared in this scope
/home/user/cloudcity/build/kwin/../../kwin/factory.h:66: error: 'BorderHuge' was not declared in this scope
/home/user/cloudcity/build/kwin/../../kwin/factory.h:66: error: 'BorderVeryHuge' was not declared in this scope
/home/user/cloudcity/build/kwin/../../kwin/factory.h:67: error: 'BorderOversized' was not declared in this scope
In file included from /home/user/cloudcity/build/kwin/moc_client.cpp:10,
from /home/user/cloudcity/build/kwin/kwin3_bespin_automoc.cpp:5:
/home/user/cloudcity/build/kwin/../../kwin/client.h: At global scope:
/home/user/cloudcity/build/kwin/../../kwin/client.h:47: error: expected class-name before '{' token
/home/user/cloudcity/build/kwin/../../kwin/client.h:50: error: expected ')' before '*' token
/home/user/cloudcity/build/kwin/../../kwin/client.h:65: error: 'KDecorationDefines' has not been declared
/home/user/cloudcity/build/kwin/../../kwin/client.h:65: error: ISO C++ forbids declaration of 'Position' with no type
/home/user/cloudcity/build/kwin/../../kwin/client.h:65: error: expected ';' before 'mousePosition'
/home/user/cloudcity/build/kwin/../../kwin/client.h:89: error: 'ColorType' has not been declared
/home/user/cloudcity/build/kwin/../../kwin/client.h:47: warning: 'class Bespin::Client' has virtual functions and accessible non-virtual destructor
/home/user/cloudcity/build/kwin/../../kwin/client.h: In member function 'Bespin::Gradients::Type Bespin::Client::gradient()':
/home/user/cloudcity/build/kwin/../../kwin/client.h:60: error: 'isActive' was not declared in this scope
In file included from /home/user/cloudcity/build/kwin/kwin3_bespin_automoc.cpp:5:
/home/user/cloudcity/build/kwin/moc_client.cpp: At global scope:
/home/user/cloudcity/build/kwin/moc_client.cpp:50: error: 'KDecoration' has not been declared
/home/user/cloudcity/build/kwin/moc_client.cpp: In member function 'virtual void* Bespin::Client::qt_metacast(const char*)':
/home/user/cloudcity/build/kwin/moc_client.cpp:64: error: 'KDecoration' has not been declared
/home/user/cloudcity/build/kwin/moc_client.cpp: In member function 'virtual int Bespin::Client::qt_metacall(QMetaObject::Call, int, void**)':
/home/user/cloudcity/build/kwin/moc_client.cpp:69: error: 'KDecoration' has not been declared
/home/user/cloudcity/build/kwin/moc_client.cpp: In member function 'void Bespin::Client::stickyChanged(bool)':
/home/user/cloudcity/build/kwin/moc_client.cpp:90: error: no matching function for call to 'QMetaObject::activate(Bespin::Client* const, const QMetaObject*, int, void* [2])'
/usr/include/QtCore/qobjectdefs.h:333: note: candidates are: static void QMetaObject::activate(QObject*, int, void**)
/usr/include/QtCore/qobjectdefs.h:334: note: static void QMetaObject::activate(QObject*, int, int, void**)
/usr/include/QtCore/qobjectdefs.h:335: note: static void QMetaObject::activate(QObject*, const QMetaObject*, int, void**)
/usr/include/QtCore/qobjectdefs.h:336: note: static void QMetaObject::activate(QObject*, const QMetaObject*, int, int, void**)
/home/user/cloudcity/build/kwin/moc_client.cpp: In member function 'void Bespin::Client::shadeChanged(bool)':
/home/user/cloudcity/build/kwin/moc_client.cpp:97: error: no matching function for call to 'QMetaObject::activate(Bespin::Client* const, const QMetaObject*, int, void* [2])'
/usr/include/QtCore/qobjectdefs.h:333: note: candidates are: static void QMetaObject::activate(QObject*, int, void**)
/usr/include/QtCore/qobjectdefs.h:334: note: static void QMetaObject::activate(QObject*, int, int, void**)
/usr/include/QtCore/qobjectdefs.h:335: note: static void QMetaObject::activate(QObject*, const QMetaObject*, int, void**)
/usr/include/QtCore/qobjectdefs.h:336: note: static void QMetaObject::activate(QObject*, const QMetaObject*, int, int, void**)
make[2]: *** [kwin/CMakeFiles/kwin3_bespin.dir/kwin3_bespin_automoc.o] Error 1
make[1]: *** [kwin/CMakeFiles/kwin3_bespin.dir/all] Error 2
make: *** [all] Error 2
- May 31 2009
Bespin

Be-Shell/Bespin by thomas12777 1663 comments

Distribution ArchLinux - May 31 2009
Bespin

Be-Shell/Bespin by thomas12777 1663 comments

KDEMod 4.2.3, QT 4.5.1, GCC 4.4.0 Snapshot - May 31 2009
Bespin

Be-Shell/Bespin by thomas12777 1663 comments

Scanning dependencies of target kwin3_bespin
[ 81%] Building CXX object kwin/CMakeFiles/kwin3_bespin.dir/kwin3_bespin_automoc.o
In file included from /home/user/cloudcity/build/kwin/moc_client.cpp:10,
from /home/user/cloudcity/build/kwin/kwin3_bespin_automoc.cpp:5:
/home/user/cloudcity/build/kwin/../../kwin/client.h:31:25: error: kdecoration.h: Нет такого файла или каталога
In file included from /home/user/cloudcity/build/kwin/../../kwin/client.h:32,
from /home/user/cloudcity/build/kwin/moc_client.cpp:10,
from /home/user/cloudcity/build/kwin/kwin3_bespin_automoc.cpp:5:
/home/user/cloudcity/build/kwin/../../kwin/factory.h:32:32: error: kdecorationfactory.h: Нет такого файла или каталога
In file included from /home/user/cloudcity/build/kwin/../../kwin/factory.h:33,
from /home/user/cloudcity/build/kwin/../../kwin/client.h:32,
from /home/user/cloudcity/build/kwin/moc_client.cpp:10,
from /home/user/cloudcity/build/kwin/kwin3_bespin_automoc.cpp:5:
/home/user/cloudcity/build/kwin/../../kwin/../gradients.h:69: предупреждение: квалификаторы в описании типа возвращаемого значения функции
/home/user/cloudcity/build/kwin/../../kwin/../gradients.h:73: предупреждение: квалификаторы в описании типа возвращаемого значения функции
In file included from /home/user/cloudcity/build/kwin/../../kwin/client.h:32,
from /home/user/cloudcity/build/kwin/moc_client.cpp:10,
from /home/user/cloudcity/build/kwin/kwin3_bespin_automoc.cpp:5:
/home/user/cloudcity/build/kwin/../../kwin/factory.h:53: ошибка: expected class-name before ‘{’ token
/home/user/cloudcity/build/kwin/../../kwin/factory.h:57: ошибка: ISO C++ запрещает декларации ‘KDecoration’ без типа
/home/user/cloudcity/build/kwin/../../kwin/factory.h:57: ошибка: expected ‘;’ before ‘*’ token
/home/user/cloudcity/build/kwin/../../kwin/factory.h:59: ошибка: ‘Ability’ has not been declared
/home/user/cloudcity/build/kwin/../../kwin/factory.h:63: ошибка: нет декларации ‘BorderSize’ в этой области видимости
/home/user/cloudcity/build/kwin/../../kwin/factory.h:63: ошибка: некорректный аргумент шаблона 1
/home/user/cloudcity/build/kwin/../../kwin/factory.h: In member function ‘int Bespin::Factory::borderSizes() const’:
/home/user/cloudcity/build/kwin/../../kwin/factory.h:65: ошибка: нет декларации ‘BorderSize’ в этой области видимости
/home/user/cloudcity/build/kwin/../../kwin/factory.h:65: ошибка: некорректный аргумент шаблона 1
/home/user/cloudcity/build/kwin/../../kwin/factory.h:65: ошибка: нет декларации ‘BorderTiny’ в этой области видимости
/home/user/cloudcity/build/kwin/../../kwin/factory.h:65: ошибка: нет декларации ‘BorderNormal’ в этой области видимости
/home/user/cloudcity/build/kwin/../../kwin/factory.h:66: ошибка: нет декларации ‘BorderLarge’ в этой области видимости
/home/user/cloudcity/build/kwin/../../kwin/factory.h:66: ошибка: нет декларации ‘BorderVeryLarge’ в этой области видимости
/home/user/cloudcity/build/kwin/../../kwin/factory.h:66: ошибка: нет декларации ‘BorderHuge’ в этой области видимости
/home/user/cloudcity/build/kwin/../../kwin/factory.h:66: ошибка: нет декларации ‘BorderVeryHuge’ в этой области видимости
/home/user/cloudcity/build/kwin/../../kwin/factory.h:67: ошибка: нет декларации ‘BorderOversized’ в этой области видимости
In file included from /home/user/cloudcity/build/kwin/moc_client.cpp:10,
from /home/user/cloudcity/build/kwin/kwin3_bespin_automoc.cpp:5:
/home/user/cloudcity/build/kwin/../../kwin/client.h: At global scope:
/home/user/cloudcity/build/kwin/../../kwin/client.h:47: ошибка: expected class-name before ‘{’ token
/home/user/cloudcity/build/kwin/../../kwin/client.h:50: ошибка: expected ‘)’ before ‘*’ token
/home/user/cloudcity/build/kwin/../../kwin/client.h:65: ошибка: ‘KDecorationDefines’ has not been declared
/home/user/cloudcity/build/kwin/../../kwin/client.h:65: ошибка: ISO C++ запрещает декларации ‘Position’ без типа
/home/user/cloudcity/build/kwin/../../kwin/client.h:65: ошибка: expected ‘;’ before ‘mousePosition’
/home/user/cloudcity/build/kwin/../../kwin/client.h:89: ошибка: ‘ColorType’ has not been declared
/home/user/cloudcity/build/kwin/../../kwin/client.h:47: предупреждение: ‘class Bespin::Client’ содержит виртуальные функции, но невиртуальный деструктор
/home/user/cloudcity/build/kwin/../../kwin/client.h: In member function ‘Bespin::Gradients::Type Bespin::Client::gradient()’:
/home/user/cloudcity/build/kwin/../../kwin/client.h:60: ошибка: нет декларации ‘isActive’ в этой области видимости
In file included from /home/user/cloudcity/build/kwin/kwin3_bespin_automoc.cpp:5:
/home/user/cloudcity/build/kwin/moc_client.cpp: At global scope:
/home/user/cloudcity/build/kwin/moc_client.cpp:50: ошибка: ‘KDecoration’ has not been declared
/home/user/cloudcity/build/kwin/moc_client.cpp: In member function ‘virtual void* Bespin::Client::qt_metacast(const char*)’:
/home/user/cloudcity/build/kwin/moc_client.cpp:64: ошибка: ‘KDecoration’ has not been declared
/home/user/cloudcity/build/kwin/moc_client.cpp: In member function ‘virtual int Bespin::Client::qt_metacall(QMetaObject::Call, int, void**)’:
/home/user/cloudcity/build/kwin/moc_client.cpp:69: ошибка: ‘KDecoration’ has not been declared
/home/user/cloudcity/build/kwin/moc_client.cpp: In member function ‘void Bespin::Client::stickyChanged(bool)’:
/home/user/cloudcity/build/kwin/moc_client.cpp:90: ошибка: нет подходящей функции для вызова ‘QMetaObject::activate(Bespin::Client* const, const QMetaObject*, int, void* [2])’
/usr/include/QtCore/qobjectdefs.h:333: замечание: претенденты: static void QMetaObject::activate(QObject*, int, void**)
/usr/include/QtCore/qobjectdefs.h:334: замечание: static void QMetaObject::activate(QObject*, int, int, void**)
/usr/include/QtCore/qobjectdefs.h:335: замечание: static void QMetaObject::activate(QObject*, const QMetaObject*, int, void**)
/usr/include/QtCore/qobjectdefs.h:336: замечание: static void QMetaObject::activate(QObject*, const QMetaObject*, int, int, void**)
/home/user/cloudcity/build/kwin/moc_client.cpp: In member function ‘void Bespin::Client::shadeChanged(bool)’:
/home/user/cloudcity/build/kwin/moc_client.cpp:97: ошибка: нет подходящей функции для вызова ‘QMetaObject::activate(Bespin::Client* const, const QMetaObject*, int, void* [2])’
/usr/include/QtCore/qobjectdefs.h:333: замечание: претенденты: static void QMetaObject::activate(QObject*, int, void**)
/usr/include/QtCore/qobjectdefs.h:334: замечание: static void QMetaObject::activate(QObject*, int, int, void**)
/usr/include/QtCore/qobjectdefs.h:335: замечание: static void QMetaObject::activate(QObject*, const QMetaObject*, int, void**)
/usr/include/QtCore/qobjectdefs.h:336: замечание: static void QMetaObject::activate(QObject*, const QMetaObject*, int, int, void**)
make[2]: *** [kwin/CMakeFiles/kwin3_bespin.dir/kwin3_bespin_automoc.o] Ошибка 1
make[1]: *** [kwin/CMakeFiles/kwin3_bespin.dir/all] Ошибка 2
make: *** [all] Ошибка 2
- May 31 2009
simple weather forecast

Plasma 4 Extensions by biophysics 204 comments

kde 4.1.85, kubuntu 8.10

user@desktop:~/plasma-weatherforecast-0.4$ make
Linking CXX shared module lib/plasma_applet_weatherforecast.so
CMakeFiles/plasma_applet_weatherforecast.dir/plasma-weatherforecast.o: In function `Plasma_Weather::parseData()':
/home/user/plasma-weatherforecast-0.4/plasma-weatherforecast.cpp:113: undefined reference to `QDomDocument::QDomDocument(QString const&)'
/home/user/plasma-weatherforecast-0.4/plasma-weatherforecast.cpp:117: undefined reference to `QDomDocument::setContent(QIODevice*, QString*, int*, int*)'
/home/user/plasma-weatherforecast-0.4/plasma-weatherforecast.cpp:120: undefined reference to `QDomDocument::documentElement() const'
/home/user/plasma-weatherforecast-0.4/plasma-weatherforecast.cpp:122: undefined reference to `QDomNode::firstChild() const'
/home/user/plasma-weatherforecast-0.4/plasma-weatherforecast.cpp:124: undefined reference to `QDomNode::firstChild() const'
/home/user/plasma-weatherforecast-0.4/plasma-weatherforecast.cpp:124: undefined reference to `QDomNode::operator=(QDomNode const&)'
/home/user/plasma-weatherforecast-0.4/plasma-weatherforecast.cpp:124: undefined reference to `QDomNode::~QDomNode()'
/home/user/plasma-weatherforecast-0.4/plasma-weatherforecast.cpp:125: undefined reference to `QDomNode::firstChild() const'
/home/user/plasma-weatherforecast-0.4/plasma-weatherforecast.cpp:125: undefined reference to `QDomNode::operator=(QDomNode const&)'
/home/user/plasma-weatherforecast-0.4/plasma-weatherforecast.cpp:125: undefined reference to `QDomNode::~QDomNode()'
/home/user/plasma-weatherforecast-0.4/plasma-weatherforecast.cpp:198: undefined reference to `QDomNode::nextSibling() const'
/home/user/plasma-weatherforecast-0.4/plasma-weatherforecast.cpp:198: undefined reference to `QDomNode::operator=(QDomNode const&)'
/home/user/plasma-weatherforecast-0.4/plasma-weatherforecast.cpp:198: undefined reference to `QDomNode::~QDomNode()'
CMakeFiles/plasma_applet_weatherforecast.dir/plasma-weatherforecast.o: In function `~QDomElement':
/usr/include/qt4/QtXml/qdom.h:472: undefined reference to `QDomNode::~QDomNode()'
CMakeFiles/plasma_applet_weatherforecast.dir/plasma-weatherforecast.o: In function `Plasma_Weather::parseData()':
/home/user/plasma-weatherforecast-0.4/plasma-weatherforecast.cpp:127: undefined reference to `QDomNode::isNull() const'
/home/user/plasma-weatherforecast-0.4/plasma-weatherforecast.cpp:129: undefined reference to `QDomNode::toElement() const'
/home/user/plasma-weatherforecast-0.4/plasma-weatherforecast.cpp:131: undefined reference to `QDomNode::isNull() const'
/home/user/plasma-weatherforecast-0.4/plasma-weatherforecast.cpp:133: undefined reference to `QDomElement::tagName() const'
/home/user/plasma-weatherforecast-0.4/plasma-weatherforecast.cpp:135: undefined reference to `QDomElement::attribute(QString const&, QString const&) const'
/home/user/plasma-weatherforecast-0.4/plasma-weatherforecast.cpp:136: undefined reference to `QDomElement::attribute(QString const&, QString const&) const'
/home/user/plasma-weatherforecast-0.4/plasma-weatherforecast.cpp:137: undefined reference to `QDomElement::attribute(QString const&, QString const&) const'
/home/user/plasma-weatherforecast-0.4/plasma-weatherforecast.cpp:139: undefined reference to `QDomElement::tagName() const'
/home/user/plasma-weatherforecast-0.4/plasma-weatherforecast.cpp:141: undefined reference to `QDomElement::attribute(QString const&, QString const&) const'
/home/user/plasma-weatherforecast-0.4/plasma-weatherforecast.cpp:199: undefined reference to `QDomNode::~QDomNode()'
CMakeFiles/plasma_applet_weatherforecast.dir/plasma-weatherforecast.o: In function `~QDomElement':
/usr/include/qt4/QtXml/qdom.h:472: undefined reference to `QDomNode::~QDomNode()'
CMakeFiles/plasma_applet_weatherforecast.dir/plasma-weatherforecast.o: In function `Plasma_Weather::parseData()':
/home/user/plasma-weatherforecast-0.4/plasma-weatherforecast.cpp:199: undefined reference to `QDomDocument::~QDomDocument()'
/home/user/plasma-weatherforecast-0.4/plasma-weatherforecast.cpp:143: undefined reference to `QDomElement::tagName() const'
/home/user/plasma-weatherforecast-0.4/plasma-weatherforecast.cpp:147: undefined reference to `QDomElement::tagName() const'
/home/user/plasma-weatherforecast-0.4/plasma-weatherforecast.cpp:149: undefined reference to `QDomNode::firstChild() const'
/home/user/plasma-weatherforecast-0.4/plasma-weatherforecast.cpp:149: undefined reference to `QDomNode::operator=(QDomNode const&)'
/home/user/plasma-weatherforecast-0.4/plasma-weatherforecast.cpp:149: undefined reference to `QDomNode::~QDomNode()'
/home/user/plasma-weatherforecast-0.4/plasma-weatherforecast.cpp:191: undefined reference to `QDomNode::nextSibling() const'
/home/user/plasma-weatherforecast-0.4/plasma-weatherforecast.cpp:191: undefined reference to `QDomNode::operator=(QDomNode const&)'
/home/user/plasma-weatherforecast-0.4/plasma-weatherforecast.cpp:191: undefined reference to `QDomNode::~QDomNode()'
CMakeFiles/plasma_applet_weatherforecast.dir/plasma-weatherforecast.o: In function `~QDomElement':
/usr/include/qt4/QtXml/qdom.h:472: undefined reference to `QDomNode::~QDomNode()'
CMakeFiles/plasma_applet_weatherforecast.dir/plasma-weatherforecast.o: In function `Plasma_Weather::parseData()':
/home/user/plasma-weatherforecast-0.4/plasma-weatherforecast.cpp:151: undefined reference to `QDomNode::isNull() const'
/home/user/plasma-weatherforecast-0.4/plasma-weatherforecast.cpp:153: undefined reference to `QDomNode::toElement() const'
/home/user/plasma-weatherforecast-0.4/plasma-weatherforecast.cpp:155: undefined reference to `QDomNode::isNull() const'
/home/user/plasma-weatherforecast-0.4/plasma-weatherforecast.cpp:157: undefined reference to `QDomElement::tagName() const'
/home/user/plasma-weatherforecast-0.4/plasma-weatherforecast.cpp:168: undefined reference to `QDomElement::tagName() const'
/home/user/plasma-weatherforecast-0.4/plasma-weatherforecast.cpp:170: undefined reference to `QDomElement::attribute(QString const&, QString const&) const'
/home/user/plasma-weatherforecast-0.4/plasma-weatherforecast.cpp:171: undefined reference to `QDomElement::attribute(QString const&, QString const&) const'
/home/user/plasma-weatherforecast-0.4/plasma-weatherforecast.cpp:172: undefined reference to `QDomElement::attribute(QString const&, QString const&) const'
/home/user/plasma-weatherforecast-0.4/plasma-weatherforecast.cpp:173: undefined reference to `QDomElement::attribute(QString const&, QString const&) const'
/home/user/plasma-weatherforecast-0.4/plasma-weatherforecast.cpp:174: undefined reference to `QDomElement::attribute(QString const&, QString const&) const'
/home/user/plasma-weatherforecast-0.4/plasma-weatherforecast.cpp:176: undefined reference to `QDomNode::nextSibling() const'
/home/user/plasma-weatherforecast-0.4/plasma-weatherforecast.cpp:176: undefined reference to `QDomNode::operator=(QDomNode const&)'
/home/user/plasma-weatherforecast-0.4/plasma-weatherforecast.cpp:176: undefined reference to `QDomNode::~QDomNode()'
/home/user/plasma-weatherforecast-0.4/plasma-weatherforecast.cpp:177: undefined reference to `QDomNode::toElement() const'
/home/user/plasma-weatherforecast-0.4/plasma-weatherforecast.cpp:178: undefined reference to `QDomElement::tagName() const'
CMakeFiles/plasma_applet_weatherforecast.dir/plasma-weatherforecast.o: In function `~QDomElement':
/usr/include/qt4/QtXml/qdom.h:472: undefined reference to `QDomNode::~QDomNode()'
CMakeFiles/plasma_applet_weatherforecast.dir/plasma-weatherforecast.o: In function `Plasma_Weather::parseData()':
/home/user/plasma-weatherforecast-0.4/plasma-weatherforecast.cpp:145: undefined reference to `QDomElement::attribute(QString const&, QString const&) const'
/home/user/plasma-weatherforecast-0.4/plasma-weatherforecast.cpp:194: undefined reference to `QDomNode::parentNode() const'
/home/user/plasma-weatherforecast-0.4/plasma-weatherforecast.cpp:194: undefined reference to `QDomNode::operator=(QDomNode const&)'
/home/user/plasma-weatherforecast-0.4/plasma-weatherforecast.cpp:194: undefined reference to `QDomNode::~QDomNode()'
/home/user/plasma-weatherforecast-0.4/plasma-weatherforecast.cpp:159: undefined reference to `QDomElement::attribute(QString const&, QString const&) const'
/home/user/plasma-weatherforecast-0.4/plasma-weatherforecast.cpp:160: undefined reference to `QDomElement::attribute(QString const&, QString const&) const'
/home/user/plasma-weatherforecast-0.4/plasma-weatherforecast.cpp:161: undefined reference to `QDomElement::attribute(QString const&, QString const&) const'
/home/user/plasma-weatherforecast-0.4/plasma-weatherforecast.cpp:181: undefined reference to `QDomElement::attribute(QString const&, QString const&) const'
/home/user/plasma-weatherforecast-0.4/plasma-weatherforecast.cpp:182: undefined reference to `QDomElement::attribute(QString const&, QString const&) const'
CMakeFiles/plasma_applet_weatherforecast.dir/plasma-weatherforecast.o:/home/user/plasma-weatherforecast-0.4/plasma-weatherforecast.cpp:183: more undefined references to `QDomElement::attribute(QString const&, QString const&) const' follow
collect2: выполнение ld завершилось с кодом возврата 1
make[2]: *** [lib/plasma_applet_weatherforecast.so] Ошибка 1
make[1]: *** [CMakeFiles/plasma_applet_weatherforecast.dir/all] Ошибка 2
make: *** [all] Ошибка 2 - Dec 20 2008
Toggle-Compositing

Plasma 4 Extensions by iovar 52 comments

Not about your applet, your applet works perfectly - Dec 20 2008
Toggle-Compositing

Plasma 4 Extensions by iovar 52 comments

KDE 4.1.85, kubuntu 8.10

Linking CXX shared module lib/plasma_applet_weatherforecast.so
CMakeFiles/plasma_applet_weatherforecast.dir/plasma-weatherforecast.o: In function `Plasma_Weather::parseData()':
/home/user/plasma-weatherforecast-0.4/plasma-weatherforecast.cpp:113: undefined reference to `QDomDocument::QDomDocument(QString const&)'
/home/user/plasma-weatherforecast-0.4/plasma-weatherforecast.cpp:117: undefined reference to `QDomDocument::setContent(QIODevice*, QString*, int*, int*)'
/home/user/plasma-weatherforecast-0.4/plasma-weatherforecast.cpp:120: undefined reference to `QDomDocument::documentElement() const'
/home/user/plasma-weatherforecast-0.4/plasma-weatherforecast.cpp:122: undefined reference to `QDomNode::firstChild() const'
/home/user/plasma-weatherforecast-0.4/plasma-weatherforecast.cpp:124: undefined reference to `QDomNode::firstChild() const'
/home/user/plasma-weatherforecast-0.4/plasma-weatherforecast.cpp:124: undefined reference to `QDomNode::operator=(QDomNode const&)'
/home/user/plasma-weatherforecast-0.4/plasma-weatherforecast.cpp:124: undefined reference to `QDomNode::~QDomNode()'
/home/user/plasma-weatherforecast-0.4/plasma-weatherforecast.cpp:125: undefined reference to `QDomNode::firstChild() const'
/home/user/plasma-weatherforecast-0.4/plasma-weatherforecast.cpp:125: undefined reference to `QDomNode::operator=(QDomNode const&)'
/home/user/plasma-weatherforecast-0.4/plasma-weatherforecast.cpp:125: undefined reference to `QDomNode::~QDomNode()'
/home/user/plasma-weatherforecast-0.4/plasma-weatherforecast.cpp:198: undefined reference to `QDomNode::nextSibling() const'
/home/user/plasma-weatherforecast-0.4/plasma-weatherforecast.cpp:198: undefined reference to `QDomNode::operator=(QDomNode const&)'
/home/user/plasma-weatherforecast-0.4/plasma-weatherforecast.cpp:198: undefined reference to `QDomNode::~QDomNode()'
CMakeFiles/plasma_applet_weatherforecast.dir/plasma-weatherforecast.o: In function `~QDomElement':
/usr/include/qt4/QtXml/qdom.h:472: undefined reference to `QDomNode::~QDomNode()'
CMakeFiles/plasma_applet_weatherforecast.dir/plasma-weatherforecast.o: In function `Plasma_Weather::parseData()':
/home/user/plasma-weatherforecast-0.4/plasma-weatherforecast.cpp:127: undefined reference to `QDomNode::isNull() const'
/home/user/plasma-weatherforecast-0.4/plasma-weatherforecast.cpp:129: undefined reference to `QDomNode::toElement() const'
/home/user/plasma-weatherforecast-0.4/plasma-weatherforecast.cpp:131: undefined reference to `QDomNode::isNull() const'
/home/user/plasma-weatherforecast-0.4/plasma-weatherforecast.cpp:133: undefined reference to `QDomElement::tagName() const'
/home/user/plasma-weatherforecast-0.4/plasma-weatherforecast.cpp:135: undefined reference to `QDomElement::attribute(QString const&, QString const&) const'
/home/user/plasma-weatherforecast-0.4/plasma-weatherforecast.cpp:136: undefined reference to `QDomElement::attribute(QString const&, QString const&) const'
/home/user/plasma-weatherforecast-0.4/plasma-weatherforecast.cpp:137: undefined reference to `QDomElement::attribute(QString const&, QString const&) const'
/home/user/plasma-weatherforecast-0.4/plasma-weatherforecast.cpp:139: undefined reference to `QDomElement::tagName() const'
/home/user/plasma-weatherforecast-0.4/plasma-weatherforecast.cpp:141: undefined reference to `QDomElement::attribute(QString const&, QString const&) const'
/home/user/plasma-weatherforecast-0.4/plasma-weatherforecast.cpp:199: undefined reference to `QDomNode::~QDomNode()'
CMakeFiles/plasma_applet_weatherforecast.dir/plasma-weatherforecast.o: In function `~QDomElement':
/usr/include/qt4/QtXml/qdom.h:472: undefined reference to `QDomNode::~QDomNode()'
CMakeFiles/plasma_applet_weatherforecast.dir/plasma-weatherforecast.o: In function `Plasma_Weather::parseData()':
/home/user/plasma-weatherforecast-0.4/plasma-weatherforecast.cpp:199: undefined reference to `QDomDocument::~QDomDocument()'
/home/user/plasma-weatherforecast-0.4/plasma-weatherforecast.cpp:143: undefined reference to `QDomElement::tagName() const'
/home/user/plasma-weatherforecast-0.4/plasma-weatherforecast.cpp:147: undefined reference to `QDomElement::tagName() const'
/home/user/plasma-weatherforecast-0.4/plasma-weatherforecast.cpp:149: undefined reference to `QDomNode::firstChild() const'
/home/user/plasma-weatherforecast-0.4/plasma-weatherforecast.cpp:149: undefined reference to `QDomNode::operator=(QDomNode const&)'
/home/user/plasma-weatherforecast-0.4/plasma-weatherforecast.cpp:149: undefined reference to `QDomNode::~QDomNode()'
/home/user/plasma-weatherforecast-0.4/plasma-weatherforecast.cpp:191: undefined reference to `QDomNode::nextSibling() const'
/home/user/plasma-weatherforecast-0.4/plasma-weatherforecast.cpp:191: undefined reference to `QDomNode::operator=(QDomNode const&)'
/home/user/plasma-weatherforecast-0.4/plasma-weatherforecast.cpp:191: undefined reference to `QDomNode::~QDomNode()'
CMakeFiles/plasma_applet_weatherforecast.dir/plasma-weatherforecast.o: In function `~QDomElement':
/usr/include/qt4/QtXml/qdom.h:472: undefined reference to `QDomNode::~QDomNode()'
CMakeFiles/plasma_applet_weatherforecast.dir/plasma-weatherforecast.o: In function `Plasma_Weather::parseData()':
/home/user/plasma-weatherforecast-0.4/plasma-weatherforecast.cpp:151: undefined reference to `QDomNode::isNull() const'
/home/user/plasma-weatherforecast-0.4/plasma-weatherforecast.cpp:153: undefined reference to `QDomNode::toElement() const'
/home/user/plasma-weatherforecast-0.4/plasma-weatherforecast.cpp:155: undefined reference to `QDomNode::isNull() const'
/home/user/plasma-weatherforecast-0.4/plasma-weatherforecast.cpp:157: undefined reference to `QDomElement::tagName() const'
/home/user/plasma-weatherforecast-0.4/plasma-weatherforecast.cpp:168: undefined reference to `QDomElement::tagName() const'
/home/user/plasma-weatherforecast-0.4/plasma-weatherforecast.cpp:170: undefined reference to `QDomElement::attribute(QString const&, QString const&) const'
/home/user/plasma-weatherforecast-0.4/plasma-weatherforecast.cpp:171: undefined reference to `QDomElement::attribute(QString const&, QString const&) const'
/home/user/plasma-weatherforecast-0.4/plasma-weatherforecast.cpp:172: undefined reference to `QDomElement::attribute(QString const&, QString const&) const'
/home/user/plasma-weatherforecast-0.4/plasma-weatherforecast.cpp:173: undefined reference to `QDomElement::attribute(QString const&, QString const&) const'
/home/user/plasma-weatherforecast-0.4/plasma-weatherforecast.cpp:174: undefined reference to `QDomElement::attribute(QString const&, QString const&) const'
/home/user/plasma-weatherforecast-0.4/plasma-weatherforecast.cpp:176: undefined reference to `QDomNode::nextSibling() const'
/home/user/plasma-weatherforecast-0.4/plasma-weatherforecast.cpp:176: undefined reference to `QDomNode::operator=(QDomNode const&)'
/home/user/plasma-weatherforecast-0.4/plasma-weatherforecast.cpp:176: undefined reference to `QDomNode::~QDomNode()'
/home/user/plasma-weatherforecast-0.4/plasma-weatherforecast.cpp:177: undefined reference to `QDomNode::toElement() const'
/home/user/plasma-weatherforecast-0.4/plasma-weatherforecast.cpp:178: undefined reference to `QDomElement::tagName() const'
CMakeFiles/plasma_applet_weatherforecast.dir/plasma-weatherforecast.o: In function `~QDomElement':
/usr/include/qt4/QtXml/qdom.h:472: undefined reference to `QDomNode::~QDomNode()'
CMakeFiles/plasma_applet_weatherforecast.dir/plasma-weatherforecast.o: In function `Plasma_Weather::parseData()':
/home/user/plasma-weatherforecast-0.4/plasma-weatherforecast.cpp:145: undefined reference to `QDomElement::attribute(QString const&, QString const&) const'
/home/user/plasma-weatherforecast-0.4/plasma-weatherforecast.cpp:194: undefined reference to `QDomNode::parentNode() const'
/home/user/plasma-weatherforecast-0.4/plasma-weatherforecast.cpp:194: undefined reference to `QDomNode::operator=(QDomNode const&)'
/home/user/plasma-weatherforecast-0.4/plasma-weatherforecast.cpp:194: undefined reference to `QDomNode::~QDomNode()'
/home/user/plasma-weatherforecast-0.4/plasma-weatherforecast.cpp:159: undefined reference to `QDomElement::attribute(QString const&, QString const&) const'
/home/user/plasma-weatherforecast-0.4/plasma-weatherforecast.cpp:160: undefined reference to `QDomElement::attribute(QString const&, QString const&) const'
/home/user/plasma-weatherforecast-0.4/plasma-weatherforecast.cpp:161: undefined reference to `QDomElement::attribute(QString const&, QString const&) const'
/home/user/plasma-weatherforecast-0.4/plasma-weatherforecast.cpp:181: undefined reference to `QDomElement::attribute(QString const&, QString const&) const'
/home/user/plasma-weatherforecast-0.4/plasma-weatherforecast.cpp:182: undefined reference to `QDomElement::attribute(QString const&, QString const&) const'
CMakeFiles/plasma_applet_weatherforecast.dir/plasma-weatherforecast.o:/home/user/plasma-weatherforecast-0.4/plasma-weatherforecast.cpp:183: more undefined references to `QDomElement::attribute(QString const&, QString const&) const' follow
collect2: выполнение ld завершилось с кодом возврата 1
make[2]: *** [lib/plasma_applet_weatherforecast.so] Ошибка 1
make[1]: *** [CMakeFiles/plasma_applet_weatherforecast.dir/all] Ошибка 2
make: *** [all] Ошибка 2 - Dec 20 2008
PlayWolf

Plasma 4 Extensions by giucam 323 comments

The applet compiles, but it is not shows the coer and any text (amarok button also unusable), other parts are work. KDE 4.1.85, (4.2 beta2), kubuntu 8.10 - Dec 20 2008
Dworkin

deKorator Themes by downdiagonal 4 comments

What bespin config and icons did you use? - Dec 20 2008
Bespin

Be-Shell/Bespin by thomas12777 1663 comments

Thank you. I found QtGlobal in /usr/include/qt4/QtCore (all packages are installed). My temporary answer was be create symbolic links for all folders exist in /usr/include/qt4/ in /usr/include. And your perfect style was compiled! (I use it from 20th revision).
But the qt4-dev pacage install all files in /usr/include/qt4 - Dec 20 2008
Bespin

Be-Shell/Bespin by thomas12777 1663 comments

after installing all qt/kde devel packages (kde 4.1.85, kubuntu 8.10) and truing compile bespin this shows error :
==================== Bespin interactive configuration ====================

Seems you have cmake.
In addition to the style, you can have a KWin decoration,
a mac-like menu plasmoid and config plugins IFF you have KDE....

read: 58: Illegal option -n

-- Found Qt-Version 4.4.3 (using /usr/bin/qmake)
-- Found X11: /usr/lib/libX11.so
CMake Error at /usr/share/kde4/apps/cmake/modules/FindKDE4Internal.cmake:1116 (message):
Could not compile simple test program:

#include <QtCore/QtGlobal>
int main()
{
#ifdef QT_VISIBILITY_AVAILABLE
return 0;
#else
return 1;
#endif
}



Change Dir: /home/user/cloudcity/build/CMakeFiles/CMakeTmp



Run Build Command:/usr/bin/gmake "cmTryCompileExec/fast"

/usr/bin/gmake -f CMakeFiles/cmTryCompileExec.dir/build.make
CMakeFiles/cmTryCompileExec.dir/build

gmake[1]: Вход в каталог
`/home/user/cloudcity/build/CMakeFiles/CMakeTmp'

/usr/bin/cmake -E cmake_progress_report
/home/user/cloudcity/build/CMakeFiles/CMakeTmp/CMakeFiles 1

Building CXX object
CMakeFiles/cmTryCompileExec.dir/check_qt_visibility.cpp.o

/usr/bin/c++ -Wnon-virtual-dtor -Wno-long-long -ansi -Wundef -Wcast-align
-Wchar-subscripts -Wall -W -Wpointer-arith -Wformat-security
-fno-exceptions -fno-check-new -fno-common -Woverloaded-virtual
-fno-threadsafe-statics -fvisibility=hidden -I/usr/include/phonon
-I/usr/include/QtXmlPatterns -I/usr/include/QtWebKit -I/usr/include/QtHelp
-I/usr/include/QtAssistant -I/usr/include/QtDBus -I/usr/include/QtTest
-I/usr/include/QtUiTools -I/usr/include/QtScript -I/usr/include/QtSvg
-I/usr/include/QtXml -I/usr/include/QtSql -I/usr/include/QtOpenGL
-I/usr/include/QtNetwork -I/usr/include/QtDesigner
-I/usr/include/Qt3Support -I/usr/include/QtGui -I/usr/include/QtCore
-I/usr/include/Qt -I/usr/share/qt4/mkspecs/default -o
CMakeFiles/cmTryCompileExec.dir/check_qt_visibility.cpp.o -c
/home/user/cloudcity/build/CMakeTmp/check_qt_visibility.cpp

gmake[1]: Выход из каталога
`/home/user/cloudcity/build/CMakeFiles/CMakeTmp'

/home/user/cloudcity/build/CMakeTmp/check_qt_visibility.cpp:1:27: error:
QtCore/QtGlobal: No such file or directory

gmake[1]: *** [CMakeFiles/cmTryCompileExec.dir/check_qt_visibility.cpp.o]
Ошибка 1

gmake: *** [cmTryCompileExec/fast] Ошибка 2

Call Stack (most recent call first):
/usr/share/cmake-2.6/Modules/FindKDE4.cmake:81 (FIND_PACKAGE)
CMakeLists.txt:13 (find_package)


-- Configuring incomplete, errors occurred! - Dec 19 2008
Flatghost

deKorator Themes
by frag

5.8
Nov 20 2010