Image 01
profile-image

shaker

Petar Petrov Sofia, Bulgaria
Waiting for spring

Wallpaper Other by Lemonade 7 comments

Thanks !
This wallpaper is beautiful.
Regards. - Jan 25 2010
Apper

System Software by dantti 225 comments

error...

Linking CXX shared library ../lib/libkpackagekitlib.so
CMakeFiles/kpackagekitlib.dir/KpkDelegate.o: In function `KpkDelegate::paintColMain(QPainter*, QStyleOptionViewItem const&, QModelIndex const&) const':
/home/shaker/Downloads/KPackageKit-0.5.2/libkpackagekit/KpkDelegate.cpp:168: undefined reference to `PackageKit::Package::iconPath()'
/home/shaker/Downloads/KPackageKit-0.5.2/libkpackagekit/KpkDelegate.cpp:178: undefined reference to `PackageKit::Package::iconPath()'
/home/shaker/Downloads/KPackageKit-0.5.2/libkpackagekit/KpkDelegate.cpp:176: undefined reference to `PackageKit::Package::iconPath()'
CMakeFiles/kpackagekitlib.dir/KpkTransaction.o: In function `KpkTransaction::updateUi()':
/home/shaker/Downloads/KPackageKit-0.5.2/libkpackagekit/KpkTransaction.cpp:225: undefined reference to `PackageKit::Transaction::percentage() const'
/home/shaker/Downloads/KPackageKit-0.5.2/libkpackagekit/KpkTransaction.cpp:226: undefined reference to `PackageKit::Transaction::subpercentage() const'
/home/shaker/Downloads/KPackageKit-0.5.2/libkpackagekit/KpkTransaction.cpp:245: undefined reference to `PackageKit::Transaction::remainingTime() const'
/home/shaker/Downloads/KPackageKit-0.5.2/libkpackagekit/KpkTransaction.cpp:248: undefined reference to `PackageKit::Transaction::status() const'
/home/shaker/Downloads/KPackageKit-0.5.2/libkpackagekit/KpkTransaction.cpp:272: undefined reference to `PackageKit::Transaction::allowCancel() const'
CMakeFiles/kpackagekitlib.dir/KpkTransaction.o: In function `KpkTransaction::setTransaction(PackageKit::Transaction*)':
/home/shaker/Downloads/KPackageKit-0.5.2/libkpackagekit/KpkTransaction.cpp:157: undefined reference to `PackageKit::Transaction::role() const'
/home/shaker/Downloads/KPackageKit-0.5.2/libkpackagekit/KpkTransaction.cpp:159: undefined reference to `PackageKit::Transaction::role() const'
/home/shaker/Downloads/KPackageKit-0.5.2/libkpackagekit/KpkTransaction.cpp:161: undefined reference to `PackageKit::Transaction::allowCancel() const'
/home/shaker/Downloads/KPackageKit-0.5.2/libkpackagekit/KpkTransaction.cpp:166: undefined reference to `PackageKit::Transaction::lastPackage() const'
/home/shaker/Downloads/KPackageKit-0.5.2/libkpackagekit/KpkTransaction.cpp:177: undefined reference to `PackageKit::Transaction::role() const'
/home/shaker/Downloads/KPackageKit-0.5.2/libkpackagekit/KpkTransaction.cpp:177: undefined reference to `PackageKit::Transaction::role() const'
CMakeFiles/kpackagekitlib.dir/KpkTransactionBar.o: In function `KpkTransactionBar::updateUi()':
/home/shaker/Downloads/KPackageKit-0.5.2/libkpackagekit/KpkTransactionBar.cpp:159: undefined reference to `PackageKit::Transaction::percentage() const'
/home/shaker/Downloads/KPackageKit-0.5.2/libkpackagekit/KpkTransactionBar.cpp:169: undefined reference to `PackageKit::Transaction::allowCancel() const'
/home/shaker/Downloads/KPackageKit-0.5.2/libkpackagekit/KpkTransactionBar.cpp:172: undefined reference to `PackageKit::Transaction::status() const'
CMakeFiles/kpackagekitlib.dir/KpkReviewChanges.o: In function `~KpkReviewChanges':
/home/shaker/Downloads/KPackageKit-0.5.2/libkpackagekit/KpkReviewChanges.cpp:101: undefined reference to `PackageKit::Bitfield::~Bitfield()'
/home/shaker/Downloads/KPackageKit-0.5.2/libkpackagekit/KpkReviewChanges.cpp:101: undefined reference to `PackageKit::Bitfield::~Bitfield()'
/home/shaker/Downloads/KPackageKit-0.5.2/libkpackagekit/KpkReviewChanges.cpp:101: undefined reference to `PackageKit::Bitfield::~Bitfield()'
CMakeFiles/kpackagekitlib.dir/KpkReviewChanges.o: In function `KpkReviewChanges::checkTask()':
/home/shaker/Downloads/KPackageKit-0.5.2/libkpackagekit/KpkReviewChanges.cpp:155: undefined reference to `PackageKit::Bitfield::operator&(long long) const'
/home/shaker/Downloads/KPackageKit-0.5.2/libkpackagekit/KpkReviewChanges.cpp:156: undefined reference to `PackageKit::Bitfield::operator&(long long) const'
/home/shaker/Downloads/KPackageKit-0.5.2/libkpackagekit/KpkReviewChanges.cpp:160: undefined reference to `PackageKit::Client::simulateRemovePackages(QList<PackageKit::Package*> const&)'
/home/shaker/Downloads/KPackageKit-0.5.2/libkpackagekit/KpkReviewChanges.cpp:161: undefined reference to `PackageKit::Transaction::error() const'
/home/shaker/Downloads/KPackageKit-0.5.2/libkpackagekit/KpkReviewChanges.cpp:192: undefined reference to `PackageKit::Bitfield::operator&(long long) const'
/home/shaker/Downloads/KPackageKit-0.5.2/libkpackagekit/KpkReviewChanges.cpp:193: undefined reference to `PackageKit::Bitfield::operator&(long long) const'
/home/shaker/Downloads/KPackageKit-0.5.2/libkpackagekit/KpkReviewChanges.cpp:197: undefined reference to `PackageKit::Client::simulateInstallPackages(QList<PackageKit::Package*> const&)'
/home/shaker/Downloads/KPackageKit-0.5.2/libkpackagekit/KpkReviewChanges.cpp:198: undefined reference to `PackageKit::Transaction::error() const'
/home/shaker/Downloads/KPackageKit-0.5.2/libkpackagekit/KpkReviewChanges.cpp:164: undefined reference to `PackageKit::Transaction::error() const'
/home/shaker/Downloads/KPackageKit-0.5.2/libkpackagekit/KpkReviewChanges.cpp:201: undefined reference to `PackageKit::Transaction::error() const'
CMakeFiles/kpackagekitlib.dir/KpkReviewChanges.o: In function `KpkReviewChanges::removePackages(bool)':
/home/shaker/Downloads/KPackageKit-0.5.2/libkpackagekit/KpkReviewChanges.cpp:310: undefined reference to `PackageKit::Transaction::error() const'
/home/shaker/Downloads/KPackageKit-0.5.2/libkpackagekit/KpkReviewChanges.cpp:313: undefined reference to `PackageKit::Transaction::error() const'
CMakeFiles/kpackagekitlib.dir/KpkReviewChanges.o: In function `KpkReviewChanges::addFinished(KpkTransaction::ExitStatus)':
/home/shaker/Downloads/KPackageKit-0.5.2/libkpackagekit/KpkReviewChanges.cpp:349: undefined reference to `PackageKit::Client::installPackages(bool, QList<PackageKit::Package*> const&)'
CMakeFiles/kpackagekitlib.dir/KpkReviewChanges.o: In function `KpkReviewChanges::installPackages()':
/home/shaker/Downloads/KPackageKit-0.5.2/libkpackagekit/KpkReviewChanges.cpp:281: undefined reference to `PackageKit::Client::installPackages(bool, QList<PackageKit::Package*> const&)'
/home/shaker/Downloads/KPackageKit-0.5.2/libkpackagekit/KpkReviewChanges.cpp:282: undefined reference to `PackageKit::Transaction::error() const'
/home/shaker/Downloads/KPackageKit-0.5.2/libkpackagekit/KpkReviewChanges.cpp:285: undefined reference to `PackageKit::Transaction::error() const'
CMakeFiles/kpackagekitlib.dir/KpkReviewChanges.o: In function `KpkReviewChanges::doAction()':
/home/shaker/Downloads/KPackageKit-0.5.2/libkpackagekit/KpkReviewChanges.cpp:133: undefined reference to `PackageKit::Client::actions() const'
/home/shaker/Downloads/KPackageKit-0.5.2/libkpackagekit/KpkReviewChanges.cpp:133: undefined reference to `PackageKit::Bitfield::operator=(PackageKit::Bitfield const&)'
/home/shaker/Downloads/KPackageKit-0.5.2/libkpackagekit/KpkReviewChanges.cpp:133: undefined reference to `PackageKit::Bitfield::~Bitfield()'
CMakeFiles/kpackagekitlib.dir/KpkReviewChanges.o: In function `KpkReviewChanges':
/home/shaker/Downloads/KPackageKit-0.5.2/libkpackagekit/KpkReviewChanges.cpp:44: undefined reference to `PackageKit::Bitfield::Bitfield()'
/home/shaker/Downloads/KPackageKit-0.5.2/libkpackagekit/KpkReviewChanges.cpp:44: undefined reference to `PackageKit::Bitfield::Bitfield()'
collect2: ld returned 1 exit status
make[2]: *** [lib/libkpackagekitlib.so] Error 1
make[1]: *** [libkpackagekit/CMakeFiles/kpackagekitlib.dir/all] Error 2
make: *** [all] Error 2 - Dec 19 2009
Apper

System Software by dantti 225 comments

error...

Linking CXX shared library ../lib/libkpackagekitlib.so
CMakeFiles/kpackagekitlib.dir/KpkDelegate.o: In function `KpkDelegate::paintColMain(QPainter*, QStyleOptionViewItem const&, QModelIndex const&) const':
/home/shaker/Downloads/KPackageKit-0.5.2/libkpackagekit/KpkDelegate.cpp:168: undefined reference to `PackageKit::Package::iconPath()'
/home/shaker/Downloads/KPackageKit-0.5.2/libkpackagekit/KpkDelegate.cpp:178: undefined reference to `PackageKit::Package::iconPath()'
/home/shaker/Downloads/KPackageKit-0.5.2/libkpackagekit/KpkDelegate.cpp:176: undefined reference to `PackageKit::Package::iconPath()'
CMakeFiles/kpackagekitlib.dir/KpkTransaction.o: In function `KpkTransaction::updateUi()':
/home/shaker/Downloads/KPackageKit-0.5.2/libkpackagekit/KpkTransaction.cpp:225: undefined reference to `PackageKit::Transaction::percentage() const'
/home/shaker/Downloads/KPackageKit-0.5.2/libkpackagekit/KpkTransaction.cpp:226: undefined reference to `PackageKit::Transaction::subpercentage() const'
/home/shaker/Downloads/KPackageKit-0.5.2/libkpackagekit/KpkTransaction.cpp:245: undefined reference to `PackageKit::Transaction::remainingTime() const'
/home/shaker/Downloads/KPackageKit-0.5.2/libkpackagekit/KpkTransaction.cpp:248: undefined reference to `PackageKit::Transaction::status() const'
/home/shaker/Downloads/KPackageKit-0.5.2/libkpackagekit/KpkTransaction.cpp:272: undefined reference to `PackageKit::Transaction::allowCancel() const'
CMakeFiles/kpackagekitlib.dir/KpkTransaction.o: In function `KpkTransaction::setTransaction(PackageKit::Transaction*)':
/home/shaker/Downloads/KPackageKit-0.5.2/libkpackagekit/KpkTransaction.cpp:157: undefined reference to `PackageKit::Transaction::role() const'
/home/shaker/Downloads/KPackageKit-0.5.2/libkpackagekit/KpkTransaction.cpp:159: undefined reference to `PackageKit::Transaction::role() const'
/home/shaker/Downloads/KPackageKit-0.5.2/libkpackagekit/KpkTransaction.cpp:161: undefined reference to `PackageKit::Transaction::allowCancel() const'
/home/shaker/Downloads/KPackageKit-0.5.2/libkpackagekit/KpkTransaction.cpp:166: undefined reference to `PackageKit::Transaction::lastPackage() const'
/home/shaker/Downloads/KPackageKit-0.5.2/libkpackagekit/KpkTransaction.cpp:177: undefined reference to `PackageKit::Transaction::role() const'
/home/shaker/Downloads/KPackageKit-0.5.2/libkpackagekit/KpkTransaction.cpp:177: undefined reference to `PackageKit::Transaction::role() const'
CMakeFiles/kpackagekitlib.dir/KpkTransactionBar.o: In function `KpkTransactionBar::updateUi()':
/home/shaker/Downloads/KPackageKit-0.5.2/libkpackagekit/KpkTransactionBar.cpp:159: undefined reference to `PackageKit::Transaction::percentage() const'
/home/shaker/Downloads/KPackageKit-0.5.2/libkpackagekit/KpkTransactionBar.cpp:169: undefined reference to `PackageKit::Transaction::allowCancel() const'
/home/shaker/Downloads/KPackageKit-0.5.2/libkpackagekit/KpkTransactionBar.cpp:172: undefined reference to `PackageKit::Transaction::status() const'
CMakeFiles/kpackagekitlib.dir/KpkReviewChanges.o: In function `~KpkReviewChanges':
/home/shaker/Downloads/KPackageKit-0.5.2/libkpackagekit/KpkReviewChanges.cpp:101: undefined reference to `PackageKit::Bitfield::~Bitfield()'
/home/shaker/Downloads/KPackageKit-0.5.2/libkpackagekit/KpkReviewChanges.cpp:101: undefined reference to `PackageKit::Bitfield::~Bitfield()'
/home/shaker/Downloads/KPackageKit-0.5.2/libkpackagekit/KpkReviewChanges.cpp:101: undefined reference to `PackageKit::Bitfield::~Bitfield()'
CMakeFiles/kpackagekitlib.dir/KpkReviewChanges.o: In function `KpkReviewChanges::checkTask()':
/home/shaker/Downloads/KPackageKit-0.5.2/libkpackagekit/KpkReviewChanges.cpp:155: undefined reference to `PackageKit::Bitfield::operator&(long long) const'
/home/shaker/Downloads/KPackageKit-0.5.2/libkpackagekit/KpkReviewChanges.cpp:156: undefined reference to `PackageKit::Bitfield::operator&(long long) const'
/home/shaker/Downloads/KPackageKit-0.5.2/libkpackagekit/KpkReviewChanges.cpp:160: undefined reference to `PackageKit::Client::simulateRemovePackages(QList<PackageKit::Package*> const&)'
/home/shaker/Downloads/KPackageKit-0.5.2/libkpackagekit/KpkReviewChanges.cpp:161: undefined reference to `PackageKit::Transaction::error() const'
/home/shaker/Downloads/KPackageKit-0.5.2/libkpackagekit/KpkReviewChanges.cpp:192: undefined reference to `PackageKit::Bitfield::operator&(long long) const'
/home/shaker/Downloads/KPackageKit-0.5.2/libkpackagekit/KpkReviewChanges.cpp:193: undefined reference to `PackageKit::Bitfield::operator&(long long) const'
/home/shaker/Downloads/KPackageKit-0.5.2/libkpackagekit/KpkReviewChanges.cpp:197: undefined reference to `PackageKit::Client::simulateInstallPackages(QList<PackageKit::Package*> const&)'
/home/shaker/Downloads/KPackageKit-0.5.2/libkpackagekit/KpkReviewChanges.cpp:198: undefined reference to `PackageKit::Transaction::error() const'
/home/shaker/Downloads/KPackageKit-0.5.2/libkpackagekit/KpkReviewChanges.cpp:164: undefined reference to `PackageKit::Transaction::error() const'
/home/shaker/Downloads/KPackageKit-0.5.2/libkpackagekit/KpkReviewChanges.cpp:201: undefined reference to `PackageKit::Transaction::error() const'
CMakeFiles/kpackagekitlib.dir/KpkReviewChanges.o: In function `KpkReviewChanges::removePackages(bool)':
/home/shaker/Downloads/KPackageKit-0.5.2/libkpackagekit/KpkReviewChanges.cpp:310: undefined reference to `PackageKit::Transaction::error() const'
/home/shaker/Downloads/KPackageKit-0.5.2/libkpackagekit/KpkReviewChanges.cpp:313: undefined reference to `PackageKit::Transaction::error() const'
CMakeFiles/kpackagekitlib.dir/KpkReviewChanges.o: In function `KpkReviewChanges::addFinished(KpkTransaction::ExitStatus)':
/home/shaker/Downloads/KPackageKit-0.5.2/libkpackagekit/KpkReviewChanges.cpp:349: undefined reference to `PackageKit::Client::installPackages(bool, QList<PackageKit::Package*> const&)'
CMakeFiles/kpackagekitlib.dir/KpkReviewChanges.o: In function `KpkReviewChanges::installPackages()':
/home/shaker/Downloads/KPackageKit-0.5.2/libkpackagekit/KpkReviewChanges.cpp:281: undefined reference to `PackageKit::Client::installPackages(bool, QList<PackageKit::Package*> const&)'
/home/shaker/Downloads/KPackageKit-0.5.2/libkpackagekit/KpkReviewChanges.cpp:282: undefined reference to `PackageKit::Transaction::error() const'
/home/shaker/Downloads/KPackageKit-0.5.2/libkpackagekit/KpkReviewChanges.cpp:285: undefined reference to `PackageKit::Transaction::error() const'
CMakeFiles/kpackagekitlib.dir/KpkReviewChanges.o: In function `KpkReviewChanges::doAction()':
/home/shaker/Downloads/KPackageKit-0.5.2/libkpackagekit/KpkReviewChanges.cpp:133: undefined reference to `PackageKit::Client::actions() const'
/home/shaker/Downloads/KPackageKit-0.5.2/libkpackagekit/KpkReviewChanges.cpp:133: undefined reference to `PackageKit::Bitfield::operator=(PackageKit::Bitfield const&)'
/home/shaker/Downloads/KPackageKit-0.5.2/libkpackagekit/KpkReviewChanges.cpp:133: undefined reference to `PackageKit::Bitfield::~Bitfield()'
CMakeFiles/kpackagekitlib.dir/KpkReviewChanges.o: In function `KpkReviewChanges':
/home/shaker/Downloads/KPackageKit-0.5.2/libkpackagekit/KpkReviewChanges.cpp:44: undefined reference to `PackageKit::Bitfield::Bitfield()'
/home/shaker/Downloads/KPackageKit-0.5.2/libkpackagekit/KpkReviewChanges.cpp:44: undefined reference to `PackageKit::Bitfield::Bitfield()'
collect2: ld returned 1 exit status
make[2]: *** [lib/libkpackagekitlib.so] Error 1
make[1]: *** [libkpackagekit/CMakeFiles/kpackagekitlib.dir/all] Error 2
make: *** [all] Error 2 - Dec 19 2009
Waiting for spring

Wallpaper Other
by Lemonade

5.8
Jan 25 2010