Image 01
profile-image

slacker9078

bradley bradley gresh , United States of America
Kwine

Various KDE 1.-4. Improvements by jlabrous 19 comments

i get this error when i try to compile this program i have gcc version 4.0.3 (Ubuntu 4.0.3-1ubuntu5) here is my error

make all-recursive
make[1]: Entering directory `/home/bradley/Desktop/KWINE/kwine_startmenu-0.1'
Making all in doc
make[2]: Entering directory `/home/bradley/Desktop/KWINE/kwine_startmenu-0.1/doc'
Making all in .
make[3]: Entering directory `/home/bradley/Desktop/KWINE/kwine_startmenu-0.1/doc'
make[3]: Nothing to be done for `all-am'.
make[3]: Leaving directory `/home/bradley/Desktop/KWINE/kwine_startmenu-0.1/doc'
Making all in en
make[3]: Entering directory `/home/bradley/Desktop/KWINE/kwine_startmenu-0.1/doc/en'
make[3]: Nothing to be done for `all'.
make[3]: Leaving directory `/home/bradley/Desktop/KWINE/kwine_startmenu-0.1/doc/en'
make[2]: Leaving directory `/home/bradley/Desktop/KWINE/kwine_startmenu-0.1/doc'
Making all in po
make[2]: Entering directory `/home/bradley/Desktop/KWINE/kwine_startmenu-0.1/po'
make[2]: Nothing to be done for `all'.
make[2]: Leaving directory `/home/bradley/Desktop/KWINE/kwine_startmenu-0.1/po'
Making all in src
make[2]: Entering directory `/home/bradley/Desktop/KWINE/kwine_startmenu-0.1/src'
source='kwine_startmenu.cpp' object='kwine_startmenu.lo' libtool=yes \
depfile='.deps/kwine_startmenu.Plo' tmpdepfile='.deps/kwine_startmenu.TPlo' \
depmode=gcc3 /bin/sh ../admin/depcomp \
/bin/sh ../libtool --silent --mode=compile --tag=CXX g++ -DHAVE_CONFIG_H -I. -I. -I.. -I/usr/include/kde -I/usr/share/qt3/include -I. -DQT_THREAD_SUPPORT -D_REENTRANT -Wnon-virtual-dtor -Wno-long-long -Wundef -Wall -W -Wpointer-arith -Wwrite-strings -ansi -D_XOPEN_SOURCE=500 -D_BSD_SOURCE -Wcast-align -Wconversion -Wchar-subscripts -O2 -Wformat-security -Wmissing-format-attribute -fno-exceptions -fno-check-new -fno-common -c -o kwine_startmenu.lo `test -f 'kwine_startmenu.cpp' || echo './'`kwine_startmenu.cpp
In file included from kwine_startmenu.cpp:20:
kwine_startmenu.h:29:32: error: kwinedcop_reg_stub.h: No such file or directory
kwine_startmenu.cpp:26:24: error: kwinetools.h: No such file or directory
kwine_startmenu.h:62: error: ISO C++ forbids declaration of 'kwinedcop_reg_stub' with no type
kwine_startmenu.h:62: error: expected ';' before '*' token
kwine_startmenu.cpp: In constructor 'KWineMenu::KWineMenu(QWidget*, const char*, const QStringList&)':
kwine_startmenu.cpp:49: error: 'registry' was not declared in this scope
kwine_startmenu.cpp:49: error: expected type-specifier before 'kwinedcop_reg_stub'
kwine_startmenu.cpp:49: error: expected `;' before 'kwinedcop_reg_stub'
kwine_startmenu.cpp: In member function 'bool KWineMenu::loadicon(const QString&, QPixmap&)':
kwine_startmenu.cpp:82: error: 'LNKInfo' was not declared in this scope
kwine_startmenu.cpp:82: error: expected `;' before 'info'
kwine_startmenu.cpp:83: error: 'info' was not declared in this scope
kwine_startmenu.cpp:83: error: 'readLNK' was not declared in this scope
kwine_startmenu.cpp:94: error: 'getIcon' was not declared in this scope
kwine_startmenu.cpp:73: warning: unused variable 'size'
kwine_startmenu.cpp: At global scope:
kwine_startmenu.cpp:106: warning: unused parameter 'icon'
kwine_startmenu.cpp: In member function 'virtual void KWineMenu::initialize()':
kwine_startmenu.cpp:159: error: 'registry' was not declared in this scope
kwine_startmenu.cpp: In member function 'virtual void KWineMenu::slotExec(int)':
kwine_startmenu.cpp:176: error: 'registry' was not declared in this scope
kwine_startmenu.cpp: In member function 'virtual void KWineMenu::mouseMoveEvent(QMouseEvent*)':
kwine_startmenu.cpp:229: error: 'LNKInfo' was not declared in this scope
kwine_startmenu.cpp:229: error: expected `;' before 'info'
kwine_startmenu.cpp:231: error: 'info' was not declared in this scope
kwine_startmenu.cpp:231: error: 'readLNK' was not declared in this scope
make[2]: *** [kwine_startmenu.lo] Error 1
make[2]: Leaving directory `/home/bradley/Desktop/KWINE/kwine_startmenu-0.1/src'
make[1]: *** [all-recursive] Error 1
make[1]: Leaving directory `/home/bradley/Desktop/KWINE/kwine_startmenu-0.1'
make: *** [all] Error 2

./configure ran fine dont really know what is wrong any help would be appreciated thanx in advanced for this great program - Aug 28 2006
KBFX Silk (KBFX 0.4.9.3.1)

Various KDE 1.-4. Improvements by sirajr 613 comments

when installing this i ran ./configure it all went well but when i ran make i got this error

/usr/lib/gcc-lib/i486-slackware-linux/3.3.6/../../../../i486-slackware-linux/bin/ld: cannot find -lkio
collect2: ld returned 1 exit status
make[3]: *** [kbfxconfigapp] Error 1
make[3]: Leaving directory `/root/Desktop/kbfx-0.4.9/kbfxconfigapp'
make[2]: *** [all-recursive] Error 1
make[2]: Leaving directory `/root/Desktop/kbfx-0.4.9/kbfxconfigapp'
make[1]: *** [all-recursive] Error 1
make[1]: Leaving directory `/root/Desktop/kbfx-0.4.9'
make: *** [all] Error 2 - Apr 15 2006
naTURE

Wallpaper Other by paninaro 5 comments

nice nature pic keep up the good work - Apr 14 2006