Image 01
profile-image

ViRgiLiO

Ignacio Monge Jerez de la Frontera, Spain
test
Liquid Weather ++

Karamba & Superkaramba 1797 comments

by Matti
Score 46.0%
Jun 01 2008
That was running configure menu option... - Nov 20 2005
sky Traceback (most recent call last):
File "/home/virgilio/.superkaramba/test_gui.py", line 41, in ?
f = lwp_config()
File "/home/virgilio/.superkaramba/lwp_config.py", line 21, in __init__
self.setSizePolicy(QSizePolicy(3,3,0,0,self.sizePolicy().hasHeightForWidth()))
TypeError: argument 1 of QSizePolicy() has an invalid type - Nov 20 2005
Menu action config not found.
python test_gui.py 0 0 0 1 0 0 0 ['Wellington Harbour'] ['http://homepages.ihug.co.nz/%7Eseebee/webcam/wgtn_harbour.jpg'] 0 0 0 verdana 0 0 0 0 0 0 Liquid bg1.png Wellington NZXX0049
Traceback (most recent call last):
File "/home/virgilio/.superkaramba/test_gui.py", line 10, in ?
f = lwp_config()
File "/home/virgilio/.superkaramba/lwp_config.py", line 206, in __init__
self.app_preview_pic.setSizePolicy(QSizePolicy(5,5,0,0,self.app_preview_pic.sizePolicy().hasHeightForWidth()))
TypeError: argument 1 of QSizePolicy() has an invalid type - Jul 31 2005
Menu action config not found.
python test_gui.py 0 0 0 1 0 0 0 ['Wellington Harbour'] ['http://homepages.ihug.co.nz/%7Eseebee/webcam/wgtn_harbour.jpg'] 0 0 0 verdana 0 0 0 0 0 0 Liquid bg1.png Wellington NZXX0049
Traceback (most recent call last):
File "/home/virgilio/.superkaramba/test_gui.py", line 10, in ?
f = lwp_config()
File "/home/virgilio/.superkaramba/lwp_config.py", line 206, in __init__
self.app_preview_pic.setSizePolicy(QSizePolicy(5,5,0,0,self.app_preview_pic.sizePolicy().hasHeightForWidth()))
TypeError: argument 1 of QSizePolicy() has an invalid type - Jul 31 2005
Menu action config not found.
python test_gui.py 0 0 0 1 0 0 0 ['Wellington Harbour'] ['http://homepages.ihug.co.nz/%7Eseebee/webcam/wgtn_harbour.jpg'] 0 0 0 verdana 0 0 0 0 0 0 Liquid bg1.png Wellington NZXX0049
Traceback (most recent call last):
File "/home/virgilio/.superkaramba/test_gui.py", line 10, in ?
f = lwp_config()
File "/home/virgilio/.superkaramba/lwp_config.py", line 206, in __init__
self.app_preview_pic.setSizePolicy(QSizePolicy(5,5,0,0,self.app_preview_pic.sizePolicy().hasHeightForWidth()))
TypeError: argument 1 of QSizePolicy() has an invalid type - Jul 31 2005
Answers.com Search

Karamba & Superkaramba 29 comments

by sg1
Score 50.0%
Nov 22 2005
1.- No need to click on answers.com icon to run the search, only press Enter button.
2.- An icon on the left side of the widget to clean the last search, and the possibility of automaticaly clear it on the configuration options.
3.- Font configuration for the input box search. - Nov 11 2005
Yakuake

System Software 1026 comments

by Sho
Score 86.7%
Mar 28 2018
Right clicking on tabs to change tab name retracts yakuake. - Oct 15 2005
Polyester

KDE 3.5 Themes 395 comments

by mart
Score 50.0%
Feb 17 2009
The download link should be http://www.fosk.it/mart/files/2_polymer.tar.bz2.

I have the same error compiling:
make[3]: Entering directory `/home/virgilio/temp/polymer/client/config'
if /bin/sh ../../libtool --silent --tag=CXX --mode=compile g++ -DHAVE_CONFIG_H -I. -I. -I../.. -I/usr/kde/3.4/include -I/usr/qt/3/include -I. -DQT_THREAD_SUPPORT -O3 -mtune=athlon64 -fomit-frame-pointer -pipe -mmmx -m3dnow -msse -msse2 -D_REENTRANT -Wnon-virtual-dtor -Wno-long-long -Wundef -Wall -W -Wpointer-arith -Wwrite-strings -ansi -D_XOPEN_SOURCE=500 -D_BSD_SOURCE -Wcast-align -Wconversion -Wchar-subscripts -O2 -O3 -mtune=athlon64 -fomit-frame-pointer -pipe -mmmx -m3dnow -msse -msse2 -Wformat-security -Wmissing-format-attribute -fno-exceptions -fno-check-new -fno-common -MT polymerconfig.lo -MD -MP -MF ".deps/polymerconfig.Tpo" -c -o polymerconfig.lo polymerconfig.cc; \
then mv -f ".deps/polymerconfig.Tpo" ".deps/polymerconfig.Plo"; else rm -f ".deps/polymerconfig.Tpo"; exit 1; fi
polymerconfig.cc:188:29: polymerconfig.moc: No such file or directory
polymerconfig.cc:33: warning: unused parameter 'config'
polymerconfig.cc:33: warning: unused parameter 'config'
make[3]: *** [polymerconfig.lo] Error 1 - Aug 31 2005
The download link should be http://www.fosk.it/mart/files/2_polymer.tar.bz2.

I have the same error compiling:
make[3]: Entering directory `/home/virgilio/temp/polymer/client/config'
if /bin/sh ../../libtool --silent --tag=CXX --mode=compile g++ -DHAVE_CONFIG_H -I. -I. -I../.. -I/usr/kde/3.4/include -I/usr/qt/3/include -I. -DQT_THREAD_SUPPORT -O3 -mtune=athlon64 -fomit-frame-pointer -pipe -mmmx -m3dnow -msse -msse2 -D_REENTRANT -Wnon-virtual-dtor -Wno-long-long -Wundef -Wall -W -Wpointer-arith -Wwrite-strings -ansi -D_XOPEN_SOURCE=500 -D_BSD_SOURCE -Wcast-align -Wconversion -Wchar-subscripts -O2 -O3 -mtune=athlon64 -fomit-frame-pointer -pipe -mmmx -m3dnow -msse -msse2 -Wformat-security -Wmissing-format-attribute -fno-exceptions -fno-check-new -fno-common -MT polymerconfig.lo -MD -MP -MF ".deps/polymerconfig.Tpo" -c -o polymerconfig.lo polymerconfig.cc; \
then mv -f ".deps/polymerconfig.Tpo" ".deps/polymerconfig.Plo"; else rm -f ".deps/polymerconfig.Tpo"; exit 1; fi
polymerconfig.cc:188:29: polymerconfig.moc: No such file or directory
polymerconfig.cc:33: warning: unused parameter 'config'
polymerconfig.cc:33: warning: unused parameter 'config'
make[3]: *** [polymerconfig.lo] Error 1 - Aug 31 2005
The download link should be http://www.fosk.it/mart/files/2_polymer.tar.bz2.

I have the same error compiling:
make[3]: Entering directory `/home/virgilio/temp/polymer/client/config'
if /bin/sh ../../libtool --silent --tag=CXX --mode=compile g++ -DHAVE_CONFIG_H -I. -I. -I../.. -I/usr/kde/3.4/include -I/usr/qt/3/include -I. -DQT_THREAD_SUPPORT -O3 -mtune=athlon64 -fomit-frame-pointer -pipe -mmmx -m3dnow -msse -msse2 -D_REENTRANT -Wnon-virtual-dtor -Wno-long-long -Wundef -Wall -W -Wpointer-arith -Wwrite-strings -ansi -D_XOPEN_SOURCE=500 -D_BSD_SOURCE -Wcast-align -Wconversion -Wchar-subscripts -O2 -O3 -mtune=athlon64 -fomit-frame-pointer -pipe -mmmx -m3dnow -msse -msse2 -Wformat-security -Wmissing-format-attribute -fno-exceptions -fno-check-new -fno-common -MT polymerconfig.lo -MD -MP -MF ".deps/polymerconfig.Tpo" -c -o polymerconfig.lo polymerconfig.cc; \
then mv -f ".deps/polymerconfig.Tpo" ".deps/polymerconfig.Plo"; else rm -f ".deps/polymerconfig.Tpo"; exit 1; fi
polymerconfig.cc:188:29: polymerconfig.moc: No such file or directory
polymerconfig.cc:33: warning: unused parameter 'config'
polymerconfig.cc:33: warning: unused parameter 'config'
make[3]: *** [polymerconfig.lo] Error 1 - Aug 31 2005
The Linux Force I

Wallpaper Other 10 comments

Score 50.0%
Dec 09 2005
How did you do it? What app did you use? - Aug 25 2005
Contactlist

Karamba & Superkaramba 66 comments

Score 50.0%
Sep 20 2005
I got this error with Contactlist and SK RC2:
Loaded my python extension!
sys.path.insert(0, '/home/virgilio/.kde3.4/share/themes/Contactlist-1.0/')
Call to initWidget failed
Traceback (most recent call last):
File "/home/virgilio/.kde3.4/share/themes/Contactlist-1.0/contactlist.py", line 147, in initWidget
widgetUpdated(widget)
File "/home/virgilio/.kde3.4/share/themes/Contactlist-1.0/contactlist.py", line 267, in widgetUpdated
karamba.hideImage(widget, images[x])
IndexError: list index out of range - Aug 15 2005
kio_resources

Various KDE 1.-4. Improvements 28 comments

Score 50.0%
Oct 27 2006
I'm actually updating my local bookmarks (icons, wallpapers...) to use your kio_resource. - Jul 17 2005
Crystal Clear

Full Icon Themes 199 comments

Score 57.4%
Jun 15 2007
try this:
make -f Makefile.cvs

and then ./configure, make and make install. - Jun 23 2005
rkward

Science 39 comments

by tfry
Score 76.7%
Oct 20 2014
Keep that work. We need programs like this on linux. - Apr 27 2005
Debug-flags as decimal: 4095
cannot find system Renviron
Fatal error: unable to open the base package

Could not open file for reading: plugins/description.xml - Apr 27 2005
g++ -DHAVE_CONFIG_H -I. -I. -I../.. -I/usr/kde/3.4/include -I/usr/qt/3/include -I. -I/usr/lib/R/include -DQT_THREAD_SUPPORT -D_REENTRANT -Wnon-virtual-dtor -Wno-long-long -Wundef -Wall -W -Wpointer-arith -Wwrite-strings -ansi -D_XOPEN_SOURCE=500 -D_BSD_SOURCE -Wcast-align -Wconversion -Wchar-subscripts -O2 -Wformat-security -Wmissing-format-attribute -fno-exceptions -fno-check-new -fno-common -c -o rkplugin.o `test -f 'rkplugin.cpp' || echo './'`rkplugin.cpp
rkplugin.cpp: In constructor `RKPlugin::RKPlugin(const QString&)':
/usr/qt/3/include/qfile.h:115: error: `QFile::QFile(const QFile&)' es privado
rkplugin.cpp:78: error: desde este contexto
make[3]: *** [rkplugin.o] Error 1
make[3]: Leaving directory `/home/virgilio/temp/rkward/rkward/plugin'
make[2]: *** [all-recursive] Error 1
make[2]: Leaving directory `/home/virgilio/temp/rkward/rkward'
make[1]: *** [all-recursive] Error 1
make[1]: Leaving directory `/home/virgilio/temp/rkward'
make: *** [all] Error 2 - Mar 27 2005
I m intensive care doctor. I m using SPPS and MEdcalc in daily clinical investigation. As a linux user Im really glad to see a project like this. Keep that work. - Sep 10 2004
Album Shaper

Graphic Apps 37 comments

Score 50.0%
Apr 11 2005
I second that. I've suggested the same thing to author some weeks ago. - Apr 11 2005
Konversation Colored Theme II

Konversation Nicklist Themes 1 comment

Score 50.0%
Apr 01 2005
It's perfect. My default theme. Thanks. - Apr 01 2005
Kontact Splash

KDE 3.x Splash Screens 2 comments

Score 50.0%
Feb 27 2005
Kontact message is too hide. - Feb 27 2005
amaroK CSS-Scheme "Mycolors"

Amarok Themes 28 comments

Score 50.0%
Feb 25 2006
We need more artwork like this. Amarok is the best audio player for Linux. Give me more! - Feb 14 2005
TextShadowEdit gentoo ebuild

Various KDE 1.-4. Improvements 8 comments

Score 50.0%
Jan 24 2005
Sorry about my limited knowledge, but how I can install this ebuild? - Jan 24 2005
Lphoto

Graphic Apps 24 comments

Score 50.0%
Jan 24 2005
It's better. - Jan 23 2005
Lsongs

Audio Apps 15 comments

Score 50.0%
Jan 24 2005
Good? It's awesome!! - Jan 23 2005
MateEdit

Text Editors 16 comments

by aramm
Score 50.0%
Aug 14 2005
I've been looking something like this for weeks! You should look http://www.codingmonkeys.de/subethaedit for ideas. - Jan 19 2005
I've been looking something like this for weeks! You should look http://www.codingmonkeys.de/subethaedit for ideas. - Jan 19 2005
myCpu

Karamba & Superkaramba 4 comments

Score 50.0%
Jan 14 2005
Try to change background of display for something more darkness and lcd with green bright numbers... - Jan 15 2005
Daneel

Various KDE 1.-4. Improvements 21 comments

Score 50.0%
Aug 21 2004
I hope you can give us some code to test soon :) - Aug 17 2004
Grounation

Cursors 34 comments

Score 67.1%
Nov 17 2004
Same problem here. - Jul 18 2004
AKDC Beta3 preview 2(see changelog)

KDE 3.x Window Decorations 357 comments

Score 50.0%
Dec 20 2004
Use de Home link. - Jul 06 2004
the missing file!
I love this decoration. Please, fix the package. - Jul 06 2004
It's the default skin for beep-media-player. - May 07 2004
BasKet Note Pads

Utilities 347 comments

Score 77.3%
Oct 01 2010
Idem on basket 4c:

if g++ -DHAVE_CONFIG_H -I. -I. -I.. -I/usr/lib/qt3//include -I/usr/X11R6/include -DQT_THREAD_SUPPORT -D_REENTRANT -Wnon-virtual-dtor -Wno-long-long -Wundef -Wall -pedantic -W -Wpointer-arith -Wwrite-strings -ansi -D_XOPEN_SOURCE=500 -D_BSD_SOURCE -Wcast-align -Wconversion -Wchar-subscripts -O2 -mtune=athlon-tbird -mmmx -m3dnow -Wformat-security -Wmissing-format-attribute -fno-exceptions -fno-check-new -fno-common -MT basket.o -MD -MP -MF ".deps/basket.Tpo" \
-c -o basket.o `test -f 'basket.cpp' || echo './'`basket.cpp; \
then mv ".deps/basket.Tpo" ".deps/basket.Po"; \
else rm -f ".deps/basket.Tpo"; exit 1; \
fi
In file included from basket.cpp:48:
itemfactory.h:58: error: extra `;'
make[2]: *** [basket.o] Error 1
- Jul 05 2004
Compiling basket 5 alpha3 - Jul 05 2004
if g++ -DHAVE_CONFIG_H -I. -I. -I.. -I/usr/lib/qt3//include -I/usr/X11R6/include -DQT_THREAD_SUPPORT -D_REENTRANT -Wnon-virtual-dtor -Wno-long-long -Wundef -Wall -pedantic -W -Wpointer-arith -Wwrite-strings -ansi -D_XOPEN_SOURCE=500 -D_BSD_SOURCE -Wcast-align -Wconversion -Wchar-subscripts -O2 -mtune=athlon-tbird -mmmx -m3dnow -Wformat-security -Wmissing-format-attribute -fno-exceptions -fno-check-new -fno-common -MT basket.o -MD -MP -MF ".deps/basket.Tpo" \
-c -o basket.o `test -f 'basket.cpp' || echo './'`basket.cpp; \
then mv -f ".deps/basket.Tpo" ".deps/basket.Po"; \
else rm -f ".deps/basket.Tpo"; exit 1; \
fi
In file included from basket.cpp:56:
xmlwork.h:41: error: extra `;'

KDE 3.2.3. GCC 3.4.1. QT 3.3.2. - Jul 05 2004
KSayIt

Audio Apps 21 comments

Score 50.0%
Aug 31 2004
MDK 10.1. KDE 3.2.2. QT 3.3.2

/qt3//include -I/usr/X11R6/include -I./ -I. -I./ -o ./audioplayer.o audioplayer.cpp
audioplayer.cpp: In member function `bool PlayEngine::loadEffects(KConfig*)':
audioplayer.cpp:46: error: call of overloaded `basic_string(QString&)' is ambiguous
/usr/include/c++/3.3.2/bits/basic_string.tcc:226: error: candidates are: std::basic_string::basic_string(const _CharT*, const _Alloc&) [with _CharT = char, _Traits = std::char_traits, _Alloc = std::allocator]
/usr/include/c++/3.3.2/bits/basic_string.tcc:192: error: std::basic_string::basic_string(const std::basic_string&) [with _CharT = char, _Traits = std::char_traits, _Alloc = std::allocator]
make[1]: *** [audioplayer.o] Error 1
make[1]: Leaving directory `/home/virgilio/temp/ksayit-0.7.2/ksayit'
make: *** [sub-ksayit] Error 2
[virgilio@localhost ksayit-0.7. - May 15 2004
MDK 10.1. KDE 3.2.2. QT 3.3.2

/qt3//include -I/usr/X11R6/include -I./ -I. -I./ -o ./audioplayer.o audioplayer.cpp
audioplayer.cpp: In member function `bool PlayEngine::loadEffects(KConfig*)':
audioplayer.cpp:46: error: call of overloaded `basic_string(QString&)' is ambiguous
/usr/include/c++/3.3.2/bits/basic_string.tcc:226: error: candidates are: std::basic_string::basic_string(const _CharT*, const _Alloc&) [with _CharT = char, _Traits = std::char_traits, _Alloc = std::allocator]
/usr/include/c++/3.3.2/bits/basic_string.tcc:192: error: std::basic_string::basic_string(const std::basic_string&) [with _CharT = char, _Traits = std::char_traits, _Alloc = std::allocator]
make[1]: *** [audioplayer.o] Error 1
make[1]: Leaving directory `/home/virgilio/temp/ksayit-0.7.2/ksayit'
make: *** [sub-ksayit] Error 2
[virgilio@localhost ksayit-0.7. - May 15 2004
MDK 10.1. KDE 3.2.2. QT 3.3.2

/qt3//include -I/usr/X11R6/include -I./ -I. -I./ -o ./audioplayer.o audioplayer.cpp
audioplayer.cpp: In member function `bool PlayEngine::loadEffects(KConfig*)':
audioplayer.cpp:46: error: call of overloaded `basic_string(QString&)' is ambiguous
/usr/include/c++/3.3.2/bits/basic_string.tcc:226: error: candidates are: std::basic_string::basic_string(const _CharT*, const _Alloc&) [with _CharT = char, _Traits = std::char_traits, _Alloc = std::allocator]
/usr/include/c++/3.3.2/bits/basic_string.tcc:192: error: std::basic_string::basic_string(const std::basic_string&) [with _CharT = char, _Traits = std::char_traits, _Alloc = std::allocator]
make[1]: *** [audioplayer.o] Error 1
make[1]: Leaving directory `/home/virgilio/temp/ksayit-0.7.2/ksayit'
make: *** [sub-ksayit] Error 2
[virgilio@localhost ksayit-0.7. - May 15 2004
MDK 10.1. KDE 3.2.2. QT 3.3.2

/qt3//include -I/usr/X11R6/include -I./ -I. -I./ -o ./audioplayer.o audioplayer.cpp
audioplayer.cpp: In member function `bool PlayEngine::loadEffects(KConfig*)':
audioplayer.cpp:46: error: call of overloaded `basic_string(QString&)' is ambiguous
/usr/include/c++/3.3.2/bits/basic_string.tcc:226: error: candidates are: std::basic_string::basic_string(const _CharT*, const _Alloc&) [with _CharT = char, _Traits = std::char_traits, _Alloc = std::allocator]
/usr/include/c++/3.3.2/bits/basic_string.tcc:192: error: std::basic_string::basic_string(const std::basic_string&) [with _CharT = char, _Traits = std::char_traits, _Alloc = std::allocator]
make[1]: *** [audioplayer.o] Error 1
make[1]: Leaving directory `/home/virgilio/temp/ksayit-0.7.2/ksayit'
make: *** [sub-ksayit] Error 2
[virgilio@localhost ksayit-0.7. - May 15 2004
Faucet CPU

Karamba & Superkaramba 3 comments

Score 50.0%
Mar 26 2004
I like your themes. - Mar 26 2004
KWin drop shadow patches

Various KDE 1.-4. Improvements 134 comments

Score 50.0%
Apr 29 2004
I can't disable drop shadows, even if all option are disable on kde control center. - Mar 18 2004
KTrayNetworker

System Software 56 comments

Score 50.0%
Apr 25 2005
Good - your configure finished. Start make now

make all-recursive
make[1]: Entering directory `/home/virgilio/temp/ktraynetworker-0.7'
Making all in doc
make[2]: Entering directory `/home/virgilio/temp/ktraynetworker-0.7/doc'
cd .. && \
/bin/sh /home/virgilio/temp/ktraynetworker-0.7/admin/missing --run automake-1.7 --gnu doc/Makefile
Can't locate object method "path" via package "Request" at /usr/share/autoconf/Autom4te/C4che.pm line 69, line 111.
configure.in: no proper invocation of AM_INIT_AUTOMAKE was found.
configure.in: You should verify that configure.in invokes AM_INIT_AUTOMAKE,
configure.in: that aclocal.m4 is present in the top-level directory,
configure.in: and that aclocal.m4 was recently regenerated (using aclocal).
configure.in: required file `./install-sh' not found
configure.in: required file `./mkinstalldirs' not found
configure.in: required file `./missing' not found
SUBDIRS: variable `AUTODIRS' is used but `AUTODIRS' is undefined
make[2]: *** [Makefile.in] Error 1
make[2]: Leaving directory `/home/virgilio/temp/ktraynetworker-0.7/doc'
make[1]: *** [all-recursive] Error 1
make[1]: Leaving directory `/home/virgilio/temp/ktraynetworker-0.7'
make: *** [all] Error 2
- Feb 15 2004
MDK 10. KDE 3.2. QT 3.3. GCC 3.3.2. GLIBC 2.3.3.

if g++ -DHAVE_CONFIG_H -I. -I. -I.. -I/usr/lib/qt3/include -I/usr/X11R6/include -DQT_THREAD_SUPPORT -D_REENTRANT -Wnon-virtual-dtor -Wno-long-long -Wundef -Wall -pedantic -W -Wpointer-arith -Wwrite-strings -ansi -D_XOPEN_SOURCE=500 -D_BSD_SOURCE -Wcast-align -Wconversion -Wchar-subscripts -O2 -O3 -march=athlon-tbird -mmmx -m3dnow -Wformat-security -Wmissing-format-attribute -fno-exceptions -fno-check-new -fno-common -MT ktm_wizard.o -MD -MP -MF ".deps/ktm_wizard.Tpo" \
-c -o ktm_wizard.o `test -f 'ktm_wizard.cpp' || echo './'`ktm_wizard.cpp; \
then mv -f ".deps/ktm_wizard.Tpo" ".deps/ktm_wizard.Po"; \
else rm -f ".deps/ktm_wizard.Tpo"; exit 1; \
fi
In file included from ktm_wizard.cpp:27:
ktm_wizard.ui.h: In member function `virtual void KTN_Wizard::KMT_Wizard_selected(const QString&)':
ktm_wizard.ui.h:21: warning: comparison between signed and unsigned integer expressions
ktm_wizard.ui.h:50: error: `setIconSet' undeclared (first use this function)
ktm_wizard.ui.h:50: error: (Each undeclared identifier is reported only once for each function it appears in.)
ktm_wizard.ui.h:54: warning: format not a string literal and no format arguments
ktm_wizard.ui.h:62: warning: comparison between signed and unsigned integer expressions
ktm_wizard.ui.h: In member function `virtual void KTN_Wizard::devicesEnabled_activated(int)':
ktm_wizard.ui.h:85: error: `setIconSet' undeclared (first use this function)
ktm_wizard.ui.h:94: warning: format not a string literal and no format arguments
ktm_wizard.ui.h: In member function `virtual void KTN_Wizard::deviceAvailable_selectionChanged()':
ktm_wizard.ui.h:134: warning: comparison between signed and unsigned integer expressions
ktm_wizard.ui.h: In member function `virtual void KTN_Wizard::deviceTheme_clicked()':
ktm_wizard.ui.h:160: error: `setIconSet' undeclared (first use this function)
ktm_wizard.cpp: In constructor `KTN_Wizard::KTN_Wizard(QWidget*, const char*, bool, unsigned int)':
ktm_wizard.cpp:84: error: invalid use of undefined type `struct KPushButton'
ktm_wizard.h:31: error: forward declaration of `struct KPushButton'
ktm_wizard.cpp:85: error: `setGeometry' undeclared (first use this function)
ktm_wizard.cpp:86: error: `setFlat' undeclared (first use this function)
ktm_wizard.cpp:147: error: no matching function for call to `KTN_Wizard::connect(KPushButton*&, const char[11], KTN_Wizard* const, const char[23])'
/usr/lib/qt3/include/qobject.h:116: error: candidates are: static bool QObject::connect(const QObject*, const char*, const QObject*, const char*)
/usr/lib/qt3/include/qobject.h:227: error: bool QObject::connect(const QObject*, const char*, const char*) const
ktm_wizard.cpp: In member function `virtual void KTN_Wizard::languageChange()':
ktm_wizard.cpp:181: error: `setText' undeclared (first use this function)
make[2]: *** [ktm_wizard.o] Error 1
make[2]: Leaving directory `/home/virgilio/temp/ktraynetworker-0.6/src'
make[1]: *** [all-recursive] Error 1
make[1]: Leaving directory `/home/virgilio/temp/ktraynetworker-0.6'
make: *** [all] Error 2
- Feb 08 2004
New Reinhard Color Scheme

KDE 3 Color Schemes 4 comments

Score 50.0%
Dec 13 2003
Really good backgrounds - Dec 13 2003
Where I can find your desktop background? - Dec 13 2003
xTunes skin for XMMS

XMMS Skins 12 comments

Score 50.0%
Oct 17 2003
Looks great on my desktop - Oct 17 2003
SuperKaramba

Karamba & Superkaramba 326 comments

Score 50.0%
Nov 16 2004
Talking about python. Will SK support python 2.3 in a nearly future? - Sep 04 2003
Superkaramba still lacks python 2.3 support, so MDK 9.2 will fall to use it.


checking for Python2.2... header /usr/include/python2.2 library no modules no
checking for Python2.1... header no library no modules no
checking for Python2.0... header no library no modules no
checking for Python1.5... header no library no modules no


rpm -qa | grep "python":
python-base-2.3-2mdk
python-2.3-2mdk
libpython2.2-2.2.3-6mdk
libpython2.3-devel-2.3-2mdk - Aug 25 2003
TubeClock

Karamba & Superkaramba 15 comments

by ntesa
Score 50.0%
Aug 30 2003
I still can't use python scripts in superkamba. I can't use Python 2.3 on my MDK 9.2, so I have to wait to SK support it. - Aug 30 2003
Score 77.7%
Sep 26 2013
Steam Time

Plasma 4 Extensions
by niceway

Score 83.8%
Jul 16 2013
Time Keeper

Plasma 5 Clocks
by niceway

Score 86.7%
Jun 27 2013
Score 80.8%
Mar 25 2012
Betelgeuse

Full Icon Themes
by acidrums4

Score 81.5%
Mar 11 2012
Gaia10

Plasma Themes
by Saleel

Score 81.7%
Mar 02 2012
light

QtCurve
by lgsalvati

Score 76.7%
Feb 27 2012
Score 82.9%
Feb 17 2012
Ronak

Plasma Themes
by pawanyadav

Score 76.4%
Feb 15 2012
Veusz

Science
by jeremysanders

Score 72.2%
Aug 22 2011
KArc

Plasma Themes
by tourada

Score 70.0%
9   Nov 12 2015
CodeKde

KDE 4 Splashscreens
by codicem

Score 78.4%
9   Mar 05 2014
Veusz

Science
by jeremysanders

Score 72.2%
9   Jan 16 2014
Peekish

QtCurve
by garthecho

Score 67.1%
9   Jan 14 2014
Aeri

QtCurve
by garthecho

Score 76.3%
9   Dec 18 2013
openSUSE Plasma theme

Plasma Themes
by sumski

Score 75.3%
9   Nov 30 2013
Score 77.7%
9   Oct 07 2013
Steam Time

Plasma 4 Extensions
by niceway

Score 83.8%
9   Jul 19 2013
Oxygen-enhanced

Plasma Color Schemes
by monom

Score 63.3%
9   Jul 19 2013
Time Keeper

Plasma 5 Clocks
by niceway

Score 86.7%
9   Jun 27 2013
UART PLOT

System Software
by sanjuchopra

Score 67.1%
9   Nov 25 2012
Score 80.8%
9   Mar 25 2012
light

QtCurve
by lgsalvati

Score 76.7%
9   Feb 27 2012
Ronak

Plasma Themes
by pawanyadav

Score 76.4%
9   Feb 15 2012