Image 01
profile-image

wastedfluid

t Generic
CoreMoid

Plasma 4 Extensions by GermanTux83 35 comments

I get an error similar to the one above.

asted@tronix:~/coremoid-0.3$ make
[ 25%] Generating ui_coremoidConfig.h
Generating coremoidapplet.moc
Scanning dependencies of target plasma_applet_coremoid
[ 50%] Building CXX object CMakeFiles/plasma_applet_coremoid.dir/plasma_applet_coremoid_automoc.o
[ 75%] Building CXX object CMakeFiles/plasma_applet_coremoid.dir/coremoidapplet.o
/home/wasted/coremoid-0.3/coremoidapplet.cpp: In member function ‘virtual void CoreMoidApplet::init()’:
/home/wasted/coremoid-0.3/coremoidapplet.cpp:98: error: ‘self’ is not a member of ‘Plasma::Theme’
/home/wasted/coremoid-0.3/coremoidapplet.cpp:99: error: ‘self’ is not a member of ‘Plasma::Theme’
make[2]: *** [CMakeFiles/plasma_applet_coremoid.dir/coremoidapplet.o] Error 1
make[1]: *** [CMakeFiles/plasma_applet_coremoid.dir/all] Error 2
make: *** [all] Error 2
wasted@tronix:~/coremoid-0.3$
- Jul 06 2008