Image 01
profile-image

zatar

thierry blanc
Kmenc15

Video Apps by ods15 36 comments

Has anyone tried to install it on a 64 (amd64 dual)?
I got the following error(s):

g++ -fno-exceptions -Wall -O2 -I/usr/include/qt3 -I -c -o main.o main.cpp
main.cpp:21:18: error: wcon.h: No such file or directory
main.cpp:23:24: error: kaboutdata.h: No such file or directory
main.cpp:24:26: error: kcmdlineargs.h: No such file or directory
main.cpp:25:21: error: klocale.h: No such file or directory
main.cpp:26:26: error: kapplication.h: No such file or directory
main.h:34: error: expected initializer before ‘&’ token
main.h:35: error: expected initializer before ‘&’ token
main.h:39: error: field ‘origfile’ has incomplete type
main.h:40: error: field ‘origidx’ has incomplete type
main.cpp:29: error: ‘I18N_NOOP’ was not declared in this scope
main.cpp:33: error: ‘KCmdLineOptions’ does not name a type
main.cpp: In function ‘int main(int, char**)’:
main.cpp:43: error: ‘KAboutData’ was not declared in this scope
main.cpp:43: error: expected `;' before ‘about’
main.cpp:45: error: ‘about’ was not declared in this scope
main.cpp:46: error: ‘KCmdLineArgs’ has not been declared
main.cpp:46: error: ‘init’ was not declared in this scope
main.cpp:47: error: ‘KCmdLineArgs’ has not been declared
main.cpp:47: error: ‘options’ was not declared in this scope
main.cpp:47: error: ‘addCmdLineOptions’ was not declared in this scope
main.cpp:48: error: aggregate ‘KApplication app’ has incomplete type and cannot be defined
main.cpp:49: error: ‘kmenc15’ was not declared in this scope
main.cpp:49: error: expected `;' before ‘mainWin’
main.cpp:60: error: ‘mainWin’ was not declared in this scope
make: *** [main.o] Error 1 - Sep 14 2006